program: Gaussian 09
title: 000224667
version: EM64L-G09RevD.01
frameworkgroup: C1[X(C10H12N2O2S)]
method: RPBEPBE
basis: SDD
operation: Freq
keyword: #p
keyword: freq=noraman
keyword: PBEPBE/SDD
title: #p freq=noraman PBEPBE/SDD
converged: YES YES NO NO
title: Mulliken charges:
elementType: S O O N N C C C C C C C C C C H H H H H H H H H H H H
charge: 0.180364 -0.253302 -0.256810 -0.450992 -0.574145 0.311556 0.271320 -0.348336 -0.386878 -0.832687 -0.238310 -0.249052 0.263355 -0.827676 0.020452 0.383696 0.305317 0.226271 0.246814 0.232427 0.230550 0.225548 0.224578 0.302913 0.300023 0.344993 0.348011
chargesum: 0.00000
title: Mulliken charges with hydrogens summed into heavy atoms:
elementType: S O O N N C C C C C C C C C C
charge: 0.180364 -0.253302 -0.256810 -0.067296 0.118860 0.311556 0.271320 -0.043020 -0.160608 -0.122896 -0.012762 -0.024473 0.263355 -0.224739 0.020452
polarizability: 1.97603540e+02 5.51765366e+00 1.62864005e+02 -3.28913222e+00 4.24472152e+00 8.75974485e+01
1716.lowfreq: -9.7559 -3.7155 -0.0020 -0.0020 -0.0013 2.4187 27.2143 46.1419 58.1536
frequency: 26.4708 46.1003 58.1494 94.2086 97.0048 148.4982 154.1927 191.2819 202.4774 210.8576 278.0113 304.0142 339.0374 387.6208 415.4002 444.6797 448.2023 471.8213 500.4729 530.7975 546.1895 549.7526 587.8809 615.7448 643.3664 666.9110 728.0955 739.7712 767.9868 781.1384 808.1777 842.6049 879.8995 901.8719 937.4020 953.6591 988.5413 994.8889 1041.0930 1048.5387 1061.2529 1111.8388 1144.9144 1173.1885 1201.0933 1232.3480 1247.5563 1274.4932 1280.0113 1300.2021 1376.3563 1402.8378 1416.6517 1438.5920 1465.9960 1478.7964 1489.1804 1539.8453 1592.5437 1595.9077 1618.0977 1624.3863 1652.3663 2970.7907 3044.5696 3045.5802 3086.6205 3119.9963 3135.2281 3143.5966 3158.5851 3192.2812 3366.5901 3521.8836 3673.5459
redmass: 4.1445 7.0019 6.1828 5.8417 6.4294 5.2848 5.6498 1.3330 2.4354 4.3457 4.5444 3.8517 3.3917 4.0084 3.2433 6.9675 3.1218 1.2637 3.9551 5.2964 1.2737 3.5857 6.4646 3.8941 4.0891 5.8616 2.7300 5.9854 1.3671 4.2242 2.1076 1.6160 1.3067 2.1394 5.7683 1.3757 1.6113 1.3094 1.5443 2.0832 2.0384 1.8762 1.2751 1.0856 2.1314 2.2066 1.2844 2.6878 2.1101 1.8308 6.0027 1.2776 1.1150 2.2418 1.7724 1.0590 1.4816 2.0622 2.1837 3.1419 6.7545 2.4778 3.3562 1.0387 1.0964 1.0605 1.0977 1.0868 1.0902 1.1048 1.0985 1.0949 1.0799 1.0449 1.1051
irintensity: 1.2725 2.3253 4.7243 3.3620 8.5911 7.2157 1.9337 3.2175 2.0633 8.8673 3.2442 3.7666 7.2177 3.0605 1.0284 1.7802 5.8133 2.5115 13.8112 2.9672 266.7969 5.7495 7.9223 50.3548 63.9566 9.0992 16.4029 6.8672 62.5752 3.5986 47.5936 74.5183 2.7399 1.3404 1.2399 4.2769 3.3190 2.1721 7.2297 17.8323 7.6123 2.1016 28.6109 0.2090 3.7067 15.6410 17.3777 177.7014 54.9012 35.5342 26.0410 15.1831 34.6265 26.0668 86.3617 10.7851 83.9672 300.6329 105.1791 48.6373 25.0930 276.3877 240.6153 22.9267 15.0934 7.7097 21.3266 8.2565 21.8149 0.0304 33.5964 8.3419 196.3734 83.2964 43.8928
temp: 298.150 k
press: 1.00000 atm
elementType: 16 8 8 7 7 6 6 6 6 6 6 6 6 6 6 1 1 1 1 1 1 1 1 1 1 1 1
symmnumber: 1
zpe: 547593.8 jmol-1
zpe.correction: 0.208567 hartree
zpe.thermalcorrener: 0.223506 hartree
zpe.thermalcorrenthalpy: 0.224450 hartree
zpe.thermalcorrgfe: 0.165331 hartree
zpe.sumelectzpe: -1045.216006 hartree
zpe.sumelectthermal: -1045.201067 hartree
zpe.sumelectthermalent: -1045.200123 hartree
zpe.sumelectthermalfe: -1045.259242 hartree
dipole: -4.0120 4.5343 -0.7472
dipole: 6.1004
quadrupole: -75.2790 -96.2102 -94.7920
quadrupole: -6.0064 4.5931 -4.7259
quadrupole: 13.4814 -7.4498 -6.0316 -6.0064 4.5931 -4.7259
hfenergy: -1045.4245732 hartree
pointgroup: C01 [X(C10H12N2O2S1)]
dipole: 1.6138189 -1.6609089 -0.6303899 debye
polarizability: 197.4146047|6.0241987|162.3480912|1.8450636|8.8769952|88.3022974 unknown
InChI: InChI=1S/C10H12N2O2S/c1-7-4-2-3-5-8(7)12-9(13)6-15-10(11)14/h2-5,12H,6,11H2,1H3
charge 0 multiplicity 1
27 atoms
S  3.298798 0.999375 -0.387062
O  0.190269 2.676628 0.622572
O  2.253366 -1.497368 0.189663
N  -0.009828 0.321817 0.496731
N  3.959932 -1.427362 -1.393119
C  -1.378349 0.147835 0.134701
C  -1.881554 -1.191923 0.068418
C  -2.228183 1.250307 -0.150533
C  -3.234307 -1.378573 -0.298185
C  -1.003648 -2.388492 0.395742
C  -3.573221 1.026027 -0.510974
C  -4.084545 -0.287644 -0.589954
C  0.678149 1.508538 0.707234
C  2.148876 1.303281 1.096183
C  3.098986 -0.851305 -0.493197
H  0.573025 -0.528181 0.555409
H  -1.824341 2.261663 -0.080423
H  -3.626509 -2.401532 -0.350105
H  -0.126752 -2.469795 -0.274422
H  -0.610378 -2.342582 1.43031
H  -1.579901 -3.32398 0.302979
H  -4.218774 1.884019 -0.729333
H  -5.128766 -0.463684 -0.870143
H  2.525552 2.232492 1.546595
H  2.295549 0.450664 1.77982
H  4.656654 -0.882764 -1.8993
H  3.896799 -2.432962 -1.550908
