program: Gaussian 09
title: 000224665
version: EM64L-G09RevD.01
frameworkgroup: C1[X(C10H10N2O4S)]
method: RPBEPBE
basis: SDD
operation: Freq
keyword: #p
keyword: freq=noraman
keyword: PBEPBE/SDD
title: #p freq=noraman PBEPBE/SDD
converged: YES YES NO NO
title: Mulliken charges:
elementType: S O O O O N N C C C C C C C C C C H H H H H H H H H H
charge: 0.109573 -0.247142 -0.428678 -0.330161 -0.195280 -0.455816 -0.565301 0.351198 0.042217 -0.333472 -0.290729 -0.214814 0.256944 -0.243349 -0.779573 0.165314 -0.010997 0.380522 0.318778 0.278005 0.236904 0.238267 0.292547 0.326956 0.387308 0.374018 0.336760
chargesum: 0.00000
title: Mulliken charges with hydrogens summed into heavy atoms:
elementType: S O O O O N N C C C C C C C C C C
charge: 0.109573 -0.247142 -0.041370 -0.330161 -0.195280 -0.075295 0.145478 0.351198 0.042217 -0.014694 -0.012724 0.022090 0.256944 -0.005081 -0.160071 0.165314 -0.010997
polarizability: 1.99924944e+02 -1.70045358e-01 1.86554947e+02 5.87707481e+00 -2.32837411e+00 9.03074896e+01
1716.lowfreq: -7.4146 -0.0028 -0.0026 -0.0023 4.2301 7.2155 27.3577 44.0162 59.1216
frequency: 27.1873 43.9960 59.0924 72.5208 93.1090 111.0307 117.0933 151.7670 179.4648 206.1468 239.6360 274.4949 310.3747 347.3753 383.7443 413.3051 421.7639 428.7895 461.0477 514.6462 523.9585 529.9141 572.4455 579.3586 595.0010 602.9799 614.5811 644.3493 667.8339 687.6368 728.6532 752.8597 763.4204 790.8893 849.5750 882.8003 907.7755 912.9507 933.5249 984.5698 1013.9312 1013.9743 1045.1660 1092.1683 1112.7775 1162.6097 1178.1749 1182.4905 1198.0442 1243.9140 1245.5277 1261.5823 1304.7708 1325.1900 1386.7883 1412.0343 1437.7194 1464.6627 1513.6226 1576.2346 1586.9336 1610.6660 1615.6697 1629.9376 1691.1733 3019.7604 3113.2155 3140.6178 3161.3578 3184.1102 3192.9586 3260.9581 3483.7512 3536.4769 3638.2762
redmass: 6.0660 7.5422 7.6837 6.6416 7.0494 6.6072 7.2862 6.3346 5.9087 3.5973 6.5141 4.2676 8.6904 6.0825 7.0524 8.7372 3.1946 6.9812 6.8088 2.4634 4.7312 1.7484 1.2828 2.6329 3.7016 4.4100 1.4280 5.6610 2.7086 4.4346 5.9615 5.4275 2.5618 1.7244 5.3231 1.6142 1.3774 1.4066 5.9949 1.3657 3.1421 1.6010 2.2050 2.0920 1.8385 1.6964 1.1998 1.1700 2.3712 1.5243 1.8088 1.9290 1.8698 2.8848 8.6361 1.0941 2.5020 2.5367 2.5424 5.2622 7.1427 2.8009 1.4702 4.1489 8.5538 1.0634 1.0986 1.0878 1.0926 1.0962 1.0958 1.0796 1.0456 1.0643 1.1041
irintensity: 0.1736 5.0974 4.3729 10.2452 3.3373 0.9493 3.3347 0.8552 12.3389 11.1006 2.0312 0.7785 0.7607 5.0511 6.7047 5.1369 13.4970 3.5197 36.7863 7.0533 0.9491 18.3009 97.4210 5.3001 51.7414 95.1459 209.7891 0.4087 169.7558 58.4667 37.5280 6.3049 36.0135 41.0593 4.2091 12.1652 0.7389 61.5673 1.8863 3.2686 203.8638 65.8570 25.0895 16.2717 119.0651 119.5382 2.8042 8.5495 21.4618 106.9056 73.3014 94.4215 53.3031 264.0876 38.5221 39.3816 30.8145 31.9139 643.4483 227.9933 164.4079 153.8831 40.1109 120.2235 283.7779 10.3958 1.9778 7.3775 13.0852 4.4472 14.6243 167.0505 81.3933 61.9385 75.4117
temp: 298.150 k
press: 1.00000 atm
elementType: 16 8 8 8 8 7 7 6 6 6 6 6 6 6 6 6 6 1 1 1 1 1 1 1 1 1 1
symmnumber: 1
zpe: 510918.5 jmol-1
zpe.correction: 0.194599 hartree
zpe.thermalcorrener: 0.210728 hartree
zpe.thermalcorrenthalpy: 0.211672 hartree
zpe.thermalcorrgfe: 0.149570 hartree
zpe.sumelectzpe: -1194.345395 hartree
zpe.sumelectthermal: -1194.329265 hartree
zpe.sumelectthermalent: -1194.328321 hartree
zpe.sumelectthermalfe: -1194.390423 hartree
dipole: 3.4382 4.9447 -0.3926
dipole: 6.0353
quadrupole: -105.4478 -95.3678 -110.2055
quadrupole: -5.9227 3.9677 3.8925
quadrupole: -1.7742 8.3059 -6.5318 -5.9227 3.9677 3.8925
hfenergy: -1194.5399936 hartree
pointgroup: C01 [X(C10H10N2O4S1)]
dipole: -1.3165552 -1.7396069 -0.9373527 debye
polarizability: 200.2024311|-0.9434637|172.6310053|1.9286062|33.9855508|103.9539435 unknown
InChI: InChI=1S/C10H10N2O4S/c11-10(16)17-5-8(13)12-7-4-2-1-3-6(7)9(14)15/h1-4,12,14H,5,11H2
charge 0 multiplicity 1
27 atoms
S  3.257062 0.426732 -0.853269
O  0.620554 2.928647 1.014998
O  -1.548963 -2.68069 -1.643015
O  0.459301 -1.630151 -1.210776
O  3.925169 -0.578411 1.661417
N  0.345855 0.839169 -0.054124
N  3.168889 -2.124004 0.064789
C  -1.052047 0.657907 0.001618
C  -1.637547 -0.543613 -0.546516
C  -1.912038 1.635435 0.579632
C  -3.051318 -0.714576 -0.506124
C  -3.303141 1.431564 0.60749
C  1.094926 1.909366 0.431039
C  -3.884815 0.258976 0.063893
C  2.619243 1.810755 0.254241
C  -0.809701 -1.609407 -1.136254
C  3.495911 -0.873464 0.523494
H  0.872796 0.081663 -0.529136
H  -1.46536 2.539351 0.996435
H  -3.4715 -1.630231 -0.929533
H  -3.941389 2.199575 1.0584
H  -4.968794 0.11196 0.088673
H  2.983495 2.763386 -0.159925
H  3.088722 1.664304 1.244954
H  -0.923284 -3.348936 -2.030738
H  2.541958 -2.225991 -0.737173
H  3.336712 -2.922618 0.678208
