program: Gaussian 09
title: 000218036
version: EM64L-G09RevD.01
frameworkgroup: C1[X(C13H15Cl2N3O2)]
method: RPBEPBE
basis: SDD
operation: Freq
keyword: #p
keyword: freq=noraman
keyword: PBEPBE/SDD
title: #p freq=noraman PBEPBE/SDD
converged: YES YES NO NO
title: Mulliken charges:
elementType: Cl Cl O O N N N C C C C C C C C C C C C C H H H H H H H H H H H H H H H
charge: -0.011682 -0.064413 -0.286208 -0.237808 -0.340854 -0.159340 -0.106549 -0.331794 -0.397841 -0.341690 -0.691196 0.224084 0.253277 -0.447854 0.512416 -0.336300 -0.252484 -0.126864 -0.179825 -0.259629 0.233549 0.187590 0.218784 0.248438 0.189211 0.205424 0.327377 0.219054 0.209259 0.218573 0.233914 0.279895 0.288500 0.260927 0.262059
chargesum: 0.00000
title: Mulliken charges with hydrogens summed into heavy atoms:
elementType: Cl Cl O O N N N C C C C C C C C C C C C C
charge: -0.011682 -0.064413 -0.286208 -0.237808 -0.013477 -0.159340 -0.106549 0.089345 0.069381 0.052945 -0.044310 0.224084 0.253277 0.065955 0.512416 -0.336300 0.036016 -0.126864 0.081102 0.002429
polarizability: 2.15899132e+02 1.00438123e+01 2.12627525e+02 -1.98720409e+01 -9.72187358e-01 1.41176309e+02
1716.lowfreq: -3.0015 0.0007 0.0013 0.0013 2.8904 6.4154 13.1977 16.0877 31.7165
frequency: 13.1377 16.0287 31.5938 38.4341 47.0506 66.0649 88.8779 104.9376 109.1725 121.5164 159.3987 184.6440 195.5375 208.2679 232.5264 244.8790 266.6738 299.9148 310.2132 334.2326 360.0865 384.5993 403.3247 436.0035 442.6743 460.7684 520.2970 536.2280 568.8826 584.5042 622.2013 671.1562 679.0722 689.4153 697.0229 738.0527 742.1354 795.5953 797.9874 816.4464 837.1026 857.0180 867.9407 900.9792 928.2520 928.5549 933.1742 958.3865 996.6262 1017.3368 1029.7445 1065.5243 1073.0707 1086.6651 1109.9704 1114.9481 1132.2416 1164.2791 1202.8947 1216.7346 1237.4625 1257.5546 1270.8663 1285.5150 1294.4378 1310.4481 1345.8979 1348.2854 1367.2151 1374.0425 1387.1018 1393.3260 1448.8687 1456.4492 1460.4650 1466.2418 1469.7423 1476.8463 1478.8708 1488.1099 1507.8506 1563.5342 1596.5565 1625.1099 2965.4389 2976.6112 2980.1473 3006.8784 3012.7049 3016.1317 3043.8258 3072.3832 3076.9794 3079.9055 3123.1199 3164.8602 3187.0529 3193.5215 3584.8264
redmass: 5.4290 7.6507 4.3929 5.0357 7.9982 1.6940 9.4955 2.5585 6.2469 7.3262 6.2596 4.0735 3.6769 4.5757 1.2648 4.2218 5.5348 7.1515 24.2518 4.8390 3.2113 3.1385 1.8193 1.9643 3.0849 7.6236 6.4011 4.3222 5.4028 6.0692 6.2293 7.5992 6.1154 5.2992 3.6048 1.9763 1.8015 1.3291 1.3151 6.3661 1.5710 8.3598 7.2568 1.7540 1.3353 1.6966 5.8801 2.3059 4.2278 4.7961 4.7126 4.9495 2.7801 1.9564 2.3497 2.3748 1.3962 2.3193 1.8089 2.9634 1.3858 1.3255 1.2736 1.2697 1.2678 1.2662 1.4410 1.3459 1.3640 6.7002 3.1257 1.2132 1.1017 1.1786 2.4971 1.4283 1.0731 1.0607 1.0498 1.0844 8.8359 6.8887 8.5009 8.6820 1.0595 1.0384 1.0596 1.0645 1.0939 1.0655 1.1015 1.1019 1.1002 1.1046 1.0985 1.0894 1.0969 1.0920 1.0777
irintensity: 0.3291 0.6729 1.9067 0.6833 5.5489 0.2435 1.2456 0.0396 2.7173 0.6728 0.4369 1.7109 2.3688 1.3264 0.8101 2.0427 0.6377 0.2932 0.1846 1.7627 8.3287 13.9988 32.7169 87.8124 14.4640 6.4074 3.6634 4.1145 12.9597 19.8409 17.0575 19.7489 8.7468 1.6626 0.2718 19.8184 31.5813 32.9678 2.3478 31.9171 52.2880 27.6536 5.2956 7.6748 0.0729 58.4855 128.6236 54.6656 9.3715 101.5307 38.7109 3.3468 3.8670 24.4945 14.4534 10.8015 12.3733 16.2762 13.0335 143.8724 2.3904 4.1634 0.6761 25.7954 15.0111 41.2458 1.3677 38.9950 21.9460 28.3764 28.1803 10.2745 31.2425 4.3905 138.1015 19.9690 0.8148 11.8890 9.0059 16.1959 0.6615 24.3960 105.0359 586.1865 28.3956 25.2708 35.5883 46.4367 13.3990 25.5964 10.2208 22.6256 45.4288 76.7648 0.9280 0.9287 0.6529 1.0747 56.7898
temp: 298.150 k
press: 1.00000 atm
elementType: 17 17 8 8 7 7 7 6 6 6 6 6 6 6 6 6 6 6 6 6 1 1 1 1 1 1 1 1 1 1 1 1 1 1 1
symmnumber: 1
zpe: 692854.2 jmol-1
zpe.correction: 0.263894 hartree
zpe.thermalcorrener: 0.284339 hartree
zpe.thermalcorrenthalpy: 0.285283 hartree
zpe.thermalcorrgfe: 0.210168 hartree
zpe.sumelectzpe: -1737.659285 hartree
zpe.sumelectthermal: -1737.638841 hartree
zpe.sumelectthermalent: -1737.637897 hartree
zpe.sumelectthermalfe: -1737.713012 hartree
dipole: 1.6572 4.5383 -0.0153
dipole: 4.8314
quadrupole: -119.6889 -143.4810 -127.1934
quadrupole: 10.1431 1.8808 1.4540
quadrupole: 10.4322 -13.3599 2.9277 10.1431 1.8808 1.4540
hfenergy: -1737.9231797 hartree
pointgroup: C01 [X(C13H15Cl2N3O2)]
dipole: 0.5847513 0.1262082 -1.8042356 debye
polarizability: 211.7415757|-24.0998447|144.7806447|-12.390234|-4.271498|213.1807453 unknown
InChI: InChI=1S/C13H15Cl2N3O2/c1-2-3-6-16-13-18-17-12(20-13)8-19-11-7-9(14)4-5-10(11)15/h4-5,7,16H,2-3,6,8H2,1H3
charge 0 multiplicity 1
35 atoms
Cl -3.59861 1.669967 2.691722
Cl -2.569636 0.218063 -3.477347
O  0.715327 -1.188818 -0.196826
O  -1.85909 -0.498672 1.700059
N  2.849119 -0.779173 -1.166444
N  2.55493 -1.41246 1.173456
N  1.370738 -1.709219 1.932784
C  4.774788 0.749483 -0.56432
C  4.318935 -0.63083 -1.090029
C  6.315097 0.853989 -0.485368
C  6.786573 2.227488 0.038582
C  2.121446 -1.111277 -0.069395
C  0.320405 -1.572557 1.134605
C  -1.119265 -1.764676 1.455539
C  -2.436168 0.180176 0.625475
C  -3.306732 1.256134 0.952862
C  -2.216446 -0.128669 -0.740773
C  -2.875006 0.631061 -1.724911
C  -3.948297 2.001885 -0.049586
C  -3.741226 1.692869 -1.415039
H  4.3402 0.907762 0.441188
H  4.379512 1.549367 -1.222766
H  4.726867 -0.812083 -2.101918
H  4.700994 -1.424947 -0.423634
H  6.752336 0.669562 -1.488464
H  6.700784 0.053599 0.17782
H  2.348673 -0.494452 -2.007756
H  7.889044 2.279932 0.09483
H  6.442049 3.045278 -0.621925
H  6.386347 2.4217 1.050894
H  -1.638869 -2.359935 0.681839
H  -1.173509 -2.285988 2.422763
H  -1.518577 -0.913819 -1.036146
H  -4.614824 2.821886 0.232505
H  -4.239111 2.265974 -2.200473
