program: Gaussian 09
title: 000218032
version: EM64L-G09RevD.01
frameworkgroup: C1[X(C23H33N3O)]
method: RPBEPBE
basis: SDD
operation: Freq
keyword: #p
keyword: freq=noraman
keyword: PBEPBE/SDD
title: #p freq=noraman PBEPBE/SDD
converged: YES YES NO NO
title: Mulliken charges:
elementType: O N N N C C C C C C C C C C C C C C C C C C C C C C C H H H H H H H H H H H H H H H H H H H H H H H H H H H H H H H H H
charge: -0.267281 -0.120855 -0.068213 -0.570461 -0.142958 -0.368158 -0.372902 -0.391594 -0.382750 -0.481973 -0.322459 0.463305 -0.567460 -0.382325 -0.385510 -0.433718 0.507970 -0.385972 -0.367902 -0.360723 0.311920 -0.421990 -0.411592 -0.230371 -0.232552 -0.245214 -0.537677 0.186504 0.213143 0.181319 0.187800 0.228827 0.179974 0.203377 0.209386 0.181725 0.230281 0.228224 0.169522 0.196777 0.238998 0.193779 0.227364 0.199153 0.261055 0.237618 0.175503 0.203635 0.236866 0.247626 0.230813 0.234900 0.260473 0.272191 0.221465 0.221642 0.225609 0.220011 0.244341 0.219511
chargesum: 0.00000
title: Mulliken charges with hydrogens summed into heavy atoms:
elementType: O N N N C C C C C C C C C C C C C C C C C C C C C C C
charge: -0.267281 -0.120855 -0.068213 -0.037797 0.043546 0.026305 0.043725 -0.008242 0.008361 -0.023467 0.043840 0.463305 -0.134683 0.044192 -0.124455 -0.196100 0.507970 -0.006834 -0.131036 -0.113097 0.311920 -0.191177 -0.176692 -0.008905 -0.010911 -0.019605 0.146187
polarizability: 2.88427693e+02 -2.34461789e+00 3.05439528e+02 -1.16425775e+01 -1.00670061e+01 2.26785218e+02
1716.lowfreq: -0.0003 0.0007 0.0011 2.6324 4.5596 7.8839 17.4509 19.2323 25.6354
frequency: 17.3136 19.0254 25.4380 29.6284 37.6392 45.1446 52.1777 61.8002 68.4633 73.0939 93.9218 113.4548 129.6032 146.0408 150.4621 171.5740 177.3790 210.2015 222.6189 234.1205 247.3884 263.6990 269.5375 278.5995 297.2929 330.2905 331.9181 339.5667 370.9871 402.8207 404.2018 416.7467 439.1857 460.7644 471.1020 492.5240 499.8875 528.9739 547.5603 555.3970 588.6259 608.4807 618.5405 624.3386 638.4702 704.7880 706.9247 735.0170 760.1752 769.9867 771.1253 778.3155 798.0191 817.8763 824.5197 827.2523 845.0920 849.2184 854.1604 869.5524 915.4985 941.4469 951.6389 964.6571 967.2096 975.3885 986.3203 989.7554 992.3916 993.3979 1000.9485 1005.6573 1012.5355 1026.2187 1031.0961 1050.4820 1056.2962 1061.3317 1084.2361 1088.9711 1094.5660 1106.5289 1111.2941 1112.4489 1119.4525 1137.4006 1144.9636 1151.5791 1155.1033 1161.3815 1171.2291 1172.8721 1186.0561 1186.7197 1196.5261 1203.7850 1218.4452 1225.5363 1238.7627 1256.3905 1262.8729 1268.6354 1274.8266 1280.2789 1289.0338 1296.2179 1301.3614 1311.7363 1313.3456 1321.6125 1328.3228 1336.6445 1346.5501 1351.5574 1370.5317 1380.4446 1383.1604 1388.4856 1391.2852 1395.7513 1414.8266 1436.2125 1441.3617 1452.2676 1454.9550 1461.9947 1464.8138 1466.0331 1467.8163 1470.7023 1472.8776 1480.5564 1482.9979 1485.1777 1494.7515 1499.2670 1584.6079 1593.3685 1614.5719 1620.7906 1639.1888 2807.3049 2822.0986 2840.2413 2852.2693 2859.3550 2860.8703 2871.2042 2956.4833 2979.9954 2982.0730 2988.6042 2992.8200 3005.5278 3021.6930 3037.4768 3042.9534 3047.8512 3055.2434 3058.9045 3059.9085 3066.4279 3111.6603 3113.7897 3117.3071 3122.5686 3129.6721 3134.1320 3140.8253 3158.4238 3160.2933 3164.5274 3451.0675 3578.5994
redmass: 3.8916 4.3765 4.7205 4.4643 2.7635 3.7084 2.4895 2.6878 3.3205 3.7260 3.3797 3.0972 4.6589 2.6589 3.1430 3.3660 3.8113 2.2109 2.8190 1.2857 1.3015 3.0650 1.9795 3.4148 4.1263 2.2672 3.6272 2.4975 4.4433 1.9806 2.7822 2.9731 3.9951 3.2265 3.5247 3.0680 3.3206 4.0862 2.8230 4.1724 3.1964 1.2973 6.3553 3.4227 3.0143 2.1198 2.0675 3.5772 2.1640 1.5015 1.9137 2.7837 2.8655 1.8573 1.4630 2.1978 1.8954 1.5848 1.2539 1.2365 1.4742 2.2818 1.3761 1.8659 1.3510 1.3871 4.2913 6.2772 1.3770 3.1243 2.4630 2.1642 3.1214 2.4086 3.0238 2.0705 2.3901 1.9916 1.8778 1.9841 2.1131 1.7846 1.7749 1.2615 2.3283 2.5893 1.9594 1.9773 1.3645 1.6217 1.0534 1.2159 1.7683 1.1737 1.4473 1.5035 2.4726 3.8454 1.4942 1.2415 1.3083 1.2825 1.2463 1.2201 1.2411 1.3475 1.2448 1.3497 1.3715 1.4575 1.2575 1.3900 1.4608 1.3225 1.4514 2.1322 7.2861 1.4875 2.0625 1.4685 3.1165 1.1745 2.1814 1.0804 1.0793 1.0889 1.0936 1.0502 1.0842 1.0971 1.0777 1.0963 1.6469 1.3679 1.0906 2.4440 7.0884 6.0435 6.1746 6.4753 1.0939 1.0805 1.0705 1.0712 1.0699 1.0709 1.0716 1.0691 1.0331 1.0610 1.0630 1.0598 1.0865 1.0847 1.0886 1.0983 1.1038 1.0907 1.0897 1.0981 1.0970 1.0930 1.0868 1.0868 1.0895 1.0990 1.0907 1.0878 1.0958 1.0946 1.1014 1.0950 1.0448 1.0975
irintensity: 0.0309 0.0715 0.1562 0.3351 1.0012 0.7262 2.5762 0.7429 1.5395 0.1421 4.6069 0.5751 0.5091 0.8115 4.2735 1.0200 0.7819 4.5402 0.8454 1.6965 38.4493 3.2856 12.8537 0.4963 4.3368 10.1038 5.3650 1.3561 1.3876 0.8170 0.0254 0.3879 2.4086 8.1983 3.6026 10.1602 11.5588 10.1579 26.5810 2.3360 16.1108 210.2605 0.0851 3.8326 3.2057 15.9932 48.3178 7.1724 28.1813 1.6221 10.8813 4.2698 11.3167 19.7109 0.3722 9.8865 61.2364 9.7044 0.1675 0.9646 3.1937 4.1873 3.8131 16.1681 0.1198 0.0282 55.0355 1.9102 0.6130 6.1654 54.3111 2.5806 2.0525 4.2660 8.7503 4.1959 0.4115 2.3167 0.4334 1.6725 3.7527 41.7830 27.7106 0.4839 13.8739 26.3388 26.2117 28.2233 0.6529 18.1901 0.2177 57.5627 1.0569 0.0257 5.0731 4.1889 0.4403 190.2409 5.1422 2.9460 17.2126 13.3003 3.5220 8.4610 11.4340 11.3135 5.1315 10.3836 29.0724 10.3828 0.1400 7.6679 28.9817 8.7150 7.3970 5.4558 0.5467 27.5687 2.9267 1.1113 2.7001 10.3274 7.0920 2.3547 0.5564 15.2025 4.1094 12.5986 3.6297 2.3820 58.6530 5.4634 18.9857 8.5123 5.1449 109.1133 9.5036 1.1671 15.9073 53.4059 40.5492 57.2270 66.3633 74.3500 31.7476 23.3919 112.9919 253.1639 68.1817 4.5478 15.7835 45.2064 25.0272 44.1950 50.3602 1.5331 49.3807 47.2102 16.9891 44.7657 65.0137 33.6934 9.7658 7.8269 14.8714 30.2272 11.0405 5.1986 46.4601 14.0964 28.6804 6.6093 2.0157 0.2314
temp: 298.150 k
press: 1.00000 atm
elementType: 8 7 7 7 6 6 6 6 6 6 6 6 6 6 6 6 6 6 6 6 6 6 6 6 6 6 6 1 1 1 1 1 1 1 1 1 1 1 1 1 1 1 1 1 1 1 1 1 1 1 1 1 1 1 1 1 1 1 1 1
symmnumber: 1
zpe: 1358649.8 jmol-1
zpe.correction: 0.517482 hartree
zpe.thermalcorrener: 0.544920 hartree
zpe.thermalcorrenthalpy: 0.545865 hartree
zpe.thermalcorrgfe: 0.455722 hartree
zpe.sumelectzpe: -1133.619735 hartree
zpe.sumelectthermal: -1133.592297 hartree
zpe.sumelectthermalent: -1133.591352 hartree
zpe.sumelectthermalfe: -1133.681495 hartree
dipole: -1.1935 -0.6920 -1.5335
dipole: 2.0628
quadrupole: -156.9806 -152.9257 -154.2749
quadrupole: 10.4800 -4.6450 -11.5005
quadrupole: -2.2536 1.8014 0.4522 10.4800 -4.6450 -11.5005
hfenergy: -1134.137217 hartree
pointgroup: C01 [X(C23H33N3O1)]
dipole: -0.4431763 0.3270268 0.5960374 debye
polarizability: 289.0624558|3.747976|304.0723944|10.0889598|-13.912421|227.517589 unknown
InChI: InChI=1S/C23H33N3O/c1-27-22-11-9-21(10-12-22)23(13-8-20-6-3-2-4-7-20)26-18-16-25(17-19-26)15-5-14-24/h2-4,6-7,9-12,23H,5,8,13-19,24H2,1H3
charge 0 multiplicity 1
60 atoms
O  1.678361 -5.42208 0.134245
N  -1.028911 0.459285 -0.052812
N  -3.807595 1.374388 0.087919
N  -8.791185 1.031887 -0.208982
C  0.273132 0.121083 -0.716592
C  -1.374133 1.904753 -0.048391
C  -2.148661 -0.3106 -0.662171
C  -2.696641 2.140722 0.701149
C  -3.467025 -0.069222 0.08613
C  1.431882 1.028318 -0.21144
C  -5.107444 1.672772 0.737763
C  0.604061 -1.355505 -0.476344
C  2.804032 0.682709 -0.852834
C  -6.317617 1.10498 -0.030656
C  0.561325 -1.894538 0.831224
C  1.002672 -2.205616 -1.538924
C  3.89894 1.629492 -0.383557
C  -7.657101 1.635167 0.520959
C  0.908705 -3.240061 1.085513
C  1.354437 -3.549577 -1.308044
C  1.310823 -4.070964 0.008562
C  4.211688 2.807971 -1.109499
C  4.609518 1.371414 0.817943
C  5.202638 3.705017 -0.649233
C  5.601047 2.264111 1.283101
C  5.90105 3.436647 0.550791
C  1.6428 -6.008816 1.474845
H  0.192049 0.279768 -1.826644
H  -0.584237 2.473709 0.469229
H  -1.472474 2.306718 -1.089264
H  -2.288644 -0.026114 -1.736046
H  -1.90057 -1.385233 -0.624696
H  -2.548739 1.859611 1.77635
H  -2.945007 3.218488 0.66214
H  -4.270618 -0.633467 -0.418494
H  -3.369854 -0.464059 1.130925
H  1.504163 0.941354 0.890402
H  1.213249 2.087242 -0.442592
H  -5.133635 1.299378 1.796812
H  -5.203097 2.776585 0.786575
H  3.069834 -0.360672 -0.60377
H  2.704519 0.734922 -1.95566
H  -6.348939 0.00112 0.018537
H  -6.212537 1.384324 -1.098732
H  0.223697 -1.250499 1.651044
H  1.034795 -1.812145 -2.562619
H  -7.639743 2.753741 0.487224
H  -7.749231 1.350291 1.587674
H  0.858929 -3.625818 2.108595
H  1.659786 -4.21061 -2.124936
H  3.678866 3.02003 -2.045432
H  4.387186 0.459506 1.386806
H  -8.776446 1.220787 -1.216878
H  -9.710595 1.224041 0.200569
H  5.432977 4.607898 -1.22677
H  6.14237 2.04446 2.210714
H  6.672057 4.128901 0.907721
H  0.620189 -5.984096 1.900112
H  1.962373 -7.052756 1.340429
H  2.340935 -5.490847 2.161508
