program: Gaussian 09
title: 000224622
version: EM64L-G09RevD.01
frameworkgroup: C1[X(C18H19NO2)]
method: RPBEPBE
basis: SDD
operation: Freq
keyword: #p
keyword: freq=noraman
keyword: PBEPBE/SDD
title: #p freq=noraman PBEPBE/SDD
converged: YES YES NO NO
title: Mulliken charges:
elementType: O O N C C C C C C C C C C C C C C C C C C H H H H H H H H H H H H H H H H H H H
charge: -0.237660 -0.235647 -0.105523 -0.173251 -0.608046 0.115384 0.140366 0.318844 -0.619292 -0.632690 0.285107 -0.363975 -0.387424 -0.334166 -0.349351 -0.245918 -0.225095 -0.226826 -0.249053 -0.230904 -0.222597 0.256029 0.264165 0.275332 0.213186 0.222836 0.227104 0.240944 0.211868 0.225365 0.263779 0.269673 0.250254 0.277153 0.230287 0.230352 0.230680 0.231350 0.233570 0.233789
chargesum: 0.00000
title: Mulliken charges with hydrogens summed into heavy atoms:
elementType: O O N C C C C C C C C C C C C C C C C C C
charge: -0.237660 -0.235647 -0.105523 0.082777 -0.068549 0.115384 0.140366 0.318844 0.043834 0.045487 0.285107 -0.100197 -0.117751 -0.083912 -0.072198 -0.015631 0.005257 0.003854 -0.017703 0.002666 0.011192
polarizability: 2.76062336e+02 -2.21563164e+01 2.08584284e+02 -8.42389061e+00 2.07938233e+01 1.45329459e+02
1716.lowfreq: -8.3293 -0.0006 -0.0005 -0.0004 2.4355 7.9028 19.6490 26.6863 30.3540
frequency: 19.4554 26.5470 30.3306 44.3841 67.4025 69.7786 90.0244 126.0244 147.8321 155.3561 170.3666 201.1545 218.7841 224.0337 248.6601 276.6638 302.4290 317.2312 340.1324 398.6936 399.9157 403.4217 416.0797 432.4939 451.0490 480.0226 526.3860 576.2004 613.3415 613.4945 640.9495 662.4518 684.9182 695.8191 699.2743 741.2998 754.6283 780.2419 793.9433 857.4504 858.4512 859.0279 932.2963 941.4891 949.7323 984.6537 985.2632 989.9918 991.0991 991.4753 995.0290 1004.5553 1011.5007 1022.4896 1028.1783 1032.1182 1040.4403 1083.5234 1085.6611 1090.5129 1108.7717 1138.2717 1168.0821 1172.0254 1172.9649 1175.6955 1188.2088 1192.3965 1217.4743 1242.6437 1264.2152 1301.6348 1311.6830 1319.5240 1344.9618 1353.6074 1384.0404 1388.3491 1418.2466 1426.7244 1434.3246 1436.6321 1443.5805 1455.6382 1467.0477 1477.5861 1479.0401 1479.7031 1494.8958 1551.2915 1563.9974 1589.4297 1596.7331 1607.5905 1611.6264 2898.1790 2909.1848 2975.2899 3018.5198 3024.6465 3033.0212 3070.7783 3079.7460 3091.3675 3126.1227 3129.0962 3137.5089 3139.1783 3150.0987 3150.5711 3159.5840 3159.6146 3169.0386 3169.7956
redmass: 5.8575 4.4145 4.5956 4.3070 4.5860 3.4585 3.5822 5.0301 5.5335 4.5611 4.7846 2.9609 1.1974 1.0863 3.5960 2.8554 5.2611 4.1851 4.4391 2.8119 2.8082 3.1664 3.3105 5.2953 3.5701 4.3446 4.1378 2.5328 6.4371 6.4330 6.8289 5.2487 4.7447 1.8102 1.5451 2.8340 4.8282 2.0296 2.4920 1.9918 1.5367 1.4300 2.3126 1.4912 2.1577 2.6068 1.9818 5.9722 2.9941 1.3907 2.8437 1.3632 1.3918 2.4907 2.0324 2.1046 1.5618 1.5963 1.5843 1.2730 2.4687 1.3971 1.7145 1.0944 1.1010 1.3270 1.1411 1.1337 2.4670 2.9317 2.4974 1.9928 1.4132 1.4132 1.4567 1.6010 8.7180 9.3688 1.1223 1.1508 2.2302 2.1678 1.1446 1.0481 1.0698 1.1144 2.0534 2.1911 1.0562 6.6582 6.9701 6.1040 6.6976 6.0187 6.2389 1.0514 1.0519 1.0592 1.0797 1.0810 1.0979 1.0861 1.0985 1.0984 1.0851 1.0851 1.0885 1.0881 1.0929 1.0924 1.0960 1.0960 1.1003 1.1013
irintensity: 1.7502 0.6498 1.9121 0.4260 1.2491 0.8144 1.3253 0.3278 0.5178 0.7880 0.0982 4.3923 2.8251 0.8939 0.8359 26.4225 6.6388 13.8587 5.2489 0.3746 0.1062 1.5545 0.8036 8.5886 2.7185 4.9803 46.0277 5.8459 0.1065 0.2203 15.0182 7.4535 7.2370 38.3766 88.7152 7.6816 2.4127 58.3055 43.1814 1.9586 1.2228 1.2281 34.6496 4.4625 13.4435 52.0090 16.6080 3.2757 1.1744 0.5892 18.9599 2.0793 0.1800 6.4308 2.3714 14.2873 6.0578 2.7997 13.0808 5.1933 10.9505 5.1102 9.3713 1.2680 11.5448 3.8673 34.5952 12.4016 175.1182 70.4683 0.6770 153.8444 4.3678 39.1755 11.2375 37.8895 4.4646 3.4031 42.2519 2.3575 17.9264 24.7922 1.0505 10.1034 24.6198 7.4977 0.8651 1.8229 14.9750 101.2557 124.6119 9.8448 32.2090 12.7680 8.2891 65.3224 99.2491 51.4596 46.2117 54.6212 0.3466 4.9217 29.6577 36.8189 0.1622 0.1212 10.1664 6.5415 14.8893 16.6916 22.6437 18.1619 23.7995 20.8107
temp: 298.150 k
press: 1.00000 atm
elementType: 8 8 7 6 6 6 6 6 6 6 6 6 6 6 6 6 6 6 6 6 6 1 1 1 1 1 1 1 1 1 1 1 1 1 1 1 1 1 1 1
symmnumber: 1
zpe: 850222.7 jmol-1
zpe.correction: 0.323833 hartree
zpe.thermalcorrener: 0.343682 hartree
zpe.thermalcorrenthalpy: 0.344626 hartree
zpe.thermalcorrgfe: 0.273004 hartree
zpe.sumelectzpe: -900.978996 hartree
zpe.sumelectthermal: -900.959147 hartree
zpe.sumelectthermalent: -900.958203 hartree
zpe.sumelectthermalfe: -901.029825 hartree
dipole: -0.7875 0.9352 -1.3063
dipole: 1.7891
quadrupole: -93.9472 -115.7201 -129.4300
quadrupole: -3.1431 -4.4210 2.2261
quadrupole: 19.0852 -2.6877 -16.3976 -3.1431 -4.4210 2.2261
hfenergy: -901.3028286 hartree
pointgroup: C01 [X(C18H19N1O2)]
dipole: -0.2877207 -0.5460344 0.338425 debye
polarizability: 274.2749744|21.1289936|187.0555874|14.8684714|37.6436377|168.6455173 unknown
InChI: InChI=1S/C18H19NO2/c1-19(2)16(18(21)15-11-7-4-8-12-15)13-17(20)14-9-5-3-6-10-14/h3-12,16H,13H2,1-2H3
charge 0 multiplicity 1
40 atoms
O  1.208721 -0.153504 -1.959181
O  -0.958016 0.697168 1.339865
N  1.263639 -2.574786 -0.049514
C  0.661466 -1.22272 0.159495
C  -0.839924 -1.215603 -0.167762
C  1.429947 -0.190124 -0.706077
C  -1.57604 -0.083469 0.552087
C  2.536005 0.621975 -0.102429
C  2.557338 -2.792053 0.633318
C  1.237912 -3.114919 -1.424033
C  -3.051103 0.079663 0.32309
C  2.52656 1.00966 1.265143
C  3.598356 1.056091 -0.942532
C  -3.785345 -0.769301 -0.54863
C  -3.731651 1.121693 1.010812
C  3.57129 1.806053 1.782006
C  4.647086 1.838226 -0.420157
C  4.637523 2.212736 0.946039
C  -5.172054 -0.578922 -0.727337
C  -5.115564 1.311047 0.832277
C  -5.840035 0.460245 -0.038141
H  0.78511 -0.9910 1.22877
H  -1.276884 -2.187787 0.137283
H  -0.98725 -1.11292 -1.261132
H  3.42644 -2.297752 0.139574
H  2.76329 -3.877868 0.670976
H  2.495845 -2.417479 1.670059
H  0.22369 -3.032718 -1.847473
H  1.511565 -4.185589 -1.383364
H  1.933358 -2.598879 -2.125911
H  1.68004 0.740302 1.904522
H  3.573275 0.771572 -1.999953
H  -3.280369 -1.576033 -1.089814
H  -3.147965 1.765934 1.676775
H  3.550137 2.117168 2.832253
H  5.467999 2.160604 -1.070329
H  5.450608 2.824929 1.352707
H  -5.731594 -1.235919 -1.401995
H  -5.631901 2.116521 1.365775
H  -6.916808 0.607159 -0.178861
