program: Gaussian 09
title: 000224621
version: EM64L-G09RevD.01
frameworkgroup: C1[X(C18H19NOS)]
method: RPBEPBE
basis: SDD
operation: Freq
keyword: #p
keyword: freq=noraman
keyword: PBEPBE/SDD
title: #p freq=noraman PBEPBE/SDD
converged: YES YES NO NO
title: Mulliken charges:
elementType: S O N C C C C C C C C C C C C C C C C C C H H H H H H H H H H H H H H H H H H H
charge: -0.057651 -0.238117 -0.036610 -0.374751 -0.358166 -0.302147 -0.302318 -0.249878 -0.594037 0.499511 -0.464755 -0.379598 0.345572 -0.399350 -0.395450 0.342284 -0.396804 -0.396512 -0.235642 -0.235477 -0.241769 0.251161 0.242709 0.232586 0.259337 0.227595 0.194249 0.206922 0.228669 0.282954 0.219379 0.230791 0.258645 0.238415 0.240338 0.237404 0.238103 0.225903 0.226171 0.230332
chargesum: 0.00000
title: Mulliken charges with hydrogens summed into heavy atoms:
elementType: S O N C C C C C C C C C C C C C C C C C C
charge: -0.057651 -0.238117 -0.036610 0.119118 0.133757 0.119696 0.133273 -0.249878 -0.091704 0.499511 -0.233964 -0.120953 0.345572 -0.160935 -0.155112 0.342284 -0.159399 -0.158408 -0.009739 -0.009306 -0.011437
polarizability: 3.13564097e+02 -3.18961786e+01 1.77758644e+02 -4.18898940e+00 -1.00419018e+01 1.90489516e+02
1716.lowfreq: -0.0011 -0.0005 0.0019 3.9735 5.9840 16.1169 20.3751 26.7281 45.8946
frequency: 19.7434 26.6707 45.5417 59.4109 65.0609 74.3426 84.5115 118.1939 165.2941 189.2243 235.3754 276.1753 292.8149 302.3521 313.7127 374.1980 395.4965 403.2107 406.3112 410.6470 418.3252 459.9204 480.1456 492.0857 518.7743 550.9173 586.0430 608.8617 614.9724 638.1610 693.7431 702.1874 708.1344 743.3075 768.8496 793.2418 807.4418 825.6594 837.3936 842.6203 850.3757 857.7496 902.2136 919.9877 944.4124 965.7313 973.6055 983.5674 989.2577 993.9271 996.1969 1011.2550 1017.7057 1022.6525 1040.7215 1044.8472 1070.9054 1085.5103 1097.1841 1109.9218 1121.8216 1161.2310 1173.7470 1186.9766 1191.0349 1196.7631 1203.4272 1211.6642 1250.3041 1259.2637 1274.8372 1290.0378 1295.5554 1306.3474 1321.9567 1326.4546 1342.9813 1349.0096 1365.4400 1369.9156 1374.0583 1413.0187 1438.2383 1441.3768 1444.5355 1448.8422 1455.7857 1464.5164 1475.9004 1485.9244 1516.3443 1567.0843 1588.8213 1612.9896 1620.9516 2949.6638 2963.7646 2984.8996 2987.0485 2995.6575 3062.5610 3062.9304 3083.5410 3093.3746 3107.2626 3120.9890 3122.6443 3124.0259 3127.4656 3140.1231 3141.9400 3148.3244 3149.3043 3165.3198
redmass: 5.0237 4.8672 4.3013 5.4831 4.4812 3.8434 4.8610 5.1698 4.1965 3.2503 6.0384 3.5497 3.0171 4.8128 4.3874 3.4059 2.3546 3.1860 3.1691 2.9120 2.3373 2.8636 4.5797 3.3156 5.9079 2.7622 2.7024 3.6655 6.1617 6.8025 3.4100 1.7681 4.3992 3.3848 1.9279 4.3061 3.9531 1.7553 2.8980 1.5707 1.2611 1.3363 2.4118 1.4410 1.8167 1.5666 1.4384 1.5862 3.6207 1.3158 6.5046 2.4201 2.8027 2.3546 1.9174 2.1575 3.7924 1.6269 2.5810 2.7790 1.5757 1.5038 1.0529 1.1737 1.1113 1.5458 1.6675 1.6057 1.3990 1.5763 1.2200 2.7879 1.4663 1.4920 1.3171 1.2540 1.2377 1.3671 2.7867 1.2641 8.1925 3.4876 2.1290 1.5242 1.1255 1.0849 1.0999 1.4746 2.1017 1.3508 2.7425 5.9706 6.4761 6.0243 6.2615 1.0682 1.0679 1.0660 1.0608 1.0684 1.1006 1.0952 1.0963 1.0982 1.0885 1.0929 1.0849 1.0874 1.0874 1.0923 1.0943 1.0962 1.0961 1.1016
irintensity: 0.4163 0.0939 0.8933 3.5513 0.7555 0.4259 0.2467 0.4579 1.1683 3.5355 0.2476 6.1337 10.8564 2.4097 5.6107 0.3965 2.2042 1.2290 0.6825 0.1941 1.0661 0.7398 3.2592 22.4006 2.9014 4.6154 13.7446 1.2114 0.1426 0.3443 4.9078 44.6438 4.0884 21.6559 71.9640 19.4302 3.8383 0.4866 4.3001 28.3632 0.7016 9.2148 2.9323 1.3439 17.2019 10.1447 0.3366 4.0298 0.2782 0.0588 11.8429 7.2262 3.3968 42.5611 3.2597 38.3986 35.7176 8.9851 24.9869 3.1441 11.9002 38.7268 0.0606 7.8360 0.9817 8.6556 17.9260 2.9194 55.3751 61.7611 17.9802 0.5524 20.6209 7.7960 1.1563 1.6507 1.8258 5.9844 1.7692 0.4210 0.1239 4.5041 17.3436 89.1794 22.9170 1.7759 4.1928 95.9290 49.0857 36.8353 17.1629 2.5011 1.0415 8.6505 0.7812 49.0173 54.4428 30.7639 24.6068 41.7835 12.7587 10.1214 29.4957 28.7457 24.1183 9.5794 10.6432 1.9938 0.8488 15.8835 13.1544 10.8211 36.3872 27.1196
temp: 298.150 k
press: 1.00000 atm
elementType: 16 8 7 6 6 6 6 6 6 6 6 6 6 6 6 6 6 6 6 6 6 1 1 1 1 1 1 1 1 1 1 1 1 1 1 1 1 1 1 1
symmnumber: 1
zpe: 857153.0 jmol-1
zpe.correction: 0.326472 hartree
zpe.thermalcorrener: 0.344816 hartree
zpe.thermalcorrenthalpy: 0.345760 hartree
zpe.thermalcorrgfe: 0.277420 hartree
zpe.sumelectzpe: -1223.831842 hartree
zpe.sumelectthermal: -1223.813498 hartree
zpe.sumelectthermalent: -1223.812554 hartree
zpe.sumelectthermalfe: -1223.880894 hartree
dipole: 1.5402 -3.1480 1.3204
dipole: 3.7450
quadrupole: -127.2492 -149.6898 -118.3461
quadrupole: 3.5784 -3.0672 -1.5172
quadrupole: 4.5125 -17.9281 13.4156 3.5784 -3.0672 -1.5172
hfenergy: -1224.1583142 hartree
pointgroup: C01 [X(C18H19N1O1S1)]
dipole: 0.4455508 -0.4650595 1.3251971 debye
polarizability: 305.6799861|-29.4304921|176.4577464|33.7315866|3.3828978|199.6745253 unknown
InChI: InChI=1S/C18H19NOS/c21-18(19-10-12-20-13-11-19)14-15-6-8-17(9-7-15)16-4-2-1-3-5-16/h1-9H,10-14H2
charge 0 multiplicity 1
40 atoms
S  -3.433855 1.528842 -2.75252
O  -5.241529 -1.697125 1.035099
N  -3.435558 -0.048906 -0.520083
C  -3.079623 -0.479624 0.856085
C  -4.342498 -1.017959 -1.186253
C  -4.364219 -0.712511 1.681384
C  -5.596822 -1.238826 -0.321871
C  -2.98941 1.09186 -1.143888
C  -2.026202 1.998221 -0.369192
C  -0.619717 1.417517 -0.187856
C  0.069901 1.560044 1.042023
C  0.044942 0.76379 -1.25653
C  2.051354 0.405137 0.137252
C  1.380579 1.064426 1.202856
C  1.354095 0.26859 -1.09547
C  3.435825 -0.123706 0.304946
C  4.373351 0.530941 1.151556
C  3.857714 -1.298423 -0.377795
C  5.682817 0.029673 1.311052
C  5.167463 -1.799826 -0.221357
C  6.087924 -1.13889 0.624898
H  -2.435212 0.26189 1.347522
H  -2.511023 -1.428256 0.788354
H  -3.799575 -1.975116 -1.31428
H  -4.603362 -0.613583 -2.179773
H  -4.117883 -1.136371 2.668875
H  -4.905636 0.249696 1.815427
H  -6.182192 -0.296689 -0.260157
H  -6.227241 -2.036733 -0.74585
H  -1.964288 2.932967 -0.951528
H  -2.448466 2.269025 0.619169
H  -0.422248 2.063554 1.884527
H  -0.465617 0.660732 -2.221285
H  1.876285 1.162969 2.175276
H  1.855744 -0.201147 -1.949135
H  4.085521 1.4567 1.662902
H  3.146706 -1.839242 -1.012677
H  6.39017 0.556317 1.961602
H  5.466931 -2.710741 -0.751885
H  7.104855 -1.527719 0.747181
