program: Gaussian 09
title: 000218007
version: EM64L-G09RevD.01
frameworkgroup: C1[X(C21H28N2O)]
method: RPBEPBE
basis: SDD
operation: Freq
keyword: #p
keyword: freq=noraman
keyword: PBEPBE/SDD
title: #p freq=noraman PBEPBE/SDD
converged: YES YES NO NO
title: Mulliken charges:
elementType: O N N C C C C C C C C C C C C C C C C C C C C C H H H H H H H H H H H H H H H H H H H H H H H H H H H H
charge: -0.267307 -0.125118 -0.057836 -0.148766 -0.352235 -0.349921 -0.398266 -0.400715 -0.479245 0.464950 -0.568204 -0.614352 -0.434038 -0.386715 0.507620 -0.360891 -0.367481 0.312090 -0.411561 -0.421630 -0.232677 -0.230537 -0.245050 -0.537788 0.187937 0.215068 0.183244 0.190131 0.228161 0.205180 0.181849 0.185724 0.205679 0.228174 0.229570 0.194089 0.238833 0.185453 0.221684 0.222240 0.237889 0.261550 0.247753 0.236890 0.234748 0.230924 0.221650 0.221672 0.225684 0.219708 0.244450 0.219739
chargesum: 0.00000
title: Mulliken charges with hydrogens summed into heavy atoms:
elementType: O N N C C C C C C C C C C C C C C C C C C C C C
charge: -0.267307 -0.125118 -0.057836 0.039171 0.046077 0.068371 -0.011237 -0.009313 -0.021500 0.464950 -0.135282 0.015026 -0.196149 -0.125165 0.507620 -0.113138 -0.130591 0.312090 -0.176812 -0.190706 -0.011027 -0.008865 -0.019366 0.146109
polarizability: 2.48410120e+02 2.06946606e+01 2.74678397e+02 3.43321304e+00 -1.38921504e+01 2.04485912e+02
1716.lowfreq: -4.2240 0.0004 0.0005 0.0005 4.9521 9.9165 11.5867 26.4433 35.9613
frequency: 11.3788 26.2471 35.8066 39.9389 42.6066 54.1696 59.1840 92.0529 114.8123 127.9997 146.6959 170.9954 201.3072 206.4811 222.9480 237.4496 243.0960 264.0824 280.9797 296.5684 329.4198 336.9319 340.0189 360.2513 403.4153 405.0904 416.8041 437.9624 455.2343 483.6451 492.2588 522.1370 543.8126 546.9918 587.0036 618.7590 622.4430 637.3891 704.3010 706.5804 734.5604 757.1103 761.5143 776.2337 796.4707 816.5062 823.9056 826.1067 844.7118 849.5687 852.8780 913.8876 928.1091 950.0756 966.1099 974.3002 985.3421 989.7416 991.4887 992.4452 1004.1116 1005.7848 1019.5747 1025.5683 1029.4086 1050.5534 1052.8901 1074.7965 1080.3231 1090.9732 1106.6788 1112.6075 1114.2746 1133.2240 1144.1964 1149.1960 1154.6893 1156.1833 1171.2448 1172.1150 1186.3469 1196.3689 1199.8994 1218.6942 1225.5858 1226.7468 1254.8923 1270.0894 1274.1022 1289.9549 1296.8543 1303.8294 1309.3019 1320.1853 1327.6256 1337.2552 1351.3729 1355.8827 1374.2462 1380.1098 1383.0271 1390.2938 1414.8211 1429.0673 1436.1197 1440.8581 1452.7668 1454.6326 1460.8064 1463.4502 1466.4997 1467.9323 1474.0442 1476.8731 1480.8545 1482.4204 1484.4045 1499.1394 1584.6717 1593.0153 1614.6547 1620.4327 2808.4180 2839.7219 2843.2755 2858.7284 2862.9682 2874.4471 2957.3457 2979.6445 2988.5781 3015.7551 3021.4112 3026.4591 3036.9346 3044.0465 3054.7817 3059.6806 3067.4213 3073.9459 3112.6577 3114.3858 3117.7696 3122.5967 3130.1136 3134.9659 3141.3682 3158.1200 3160.5518 3165.0193
redmass: 3.6940 4.5128 3.9534 3.6312 4.3892 2.8927 3.4662 3.3541 3.6245 4.0289 3.3209 3.0963 4.4589 2.6661 1.8350 1.3855 1.3860 2.8757 1.9706 3.9492 2.5246 2.5619 2.8170 3.0727 2.7891 2.0160 2.9571 3.9967 4.1305 3.1546 3.1750 3.5996 4.3051 2.7618 3.1425 6.3519 3.2855 3.4415 1.9983 2.1606 3.5859 3.1865 2.2388 2.9544 2.7609 1.8280 1.5329 2.1725 1.8877 1.5517 1.2578 1.5092 2.0456 1.3782 1.3542 1.3885 3.5794 6.3003 1.4821 3.0499 2.5136 2.0905 2.8221 2.7434 2.5505 1.6458 2.2121 1.6339 1.6967 1.7109 1.4744 1.2640 1.9295 1.8860 2.1488 2.6868 1.5613 1.4408 1.0545 1.2068 1.1178 1.2596 1.6435 2.4060 3.8662 2.2071 1.2689 1.3986 1.3779 1.5357 1.3612 1.2338 1.3790 1.4475 1.2614 1.4123 1.3983 1.4364 1.5178 1.7524 7.5257 2.4192 3.1049 1.1745 1.1757 2.1849 1.0771 1.0787 1.0673 1.0904 1.0503 1.0931 1.0787 1.1107 1.0541 1.2621 1.8406 2.4313 7.1326 6.0524 6.2078 6.4789 1.0805 1.0694 1.0647 1.0639 1.0701 1.0682 1.0330 1.0609 1.0596 1.0724 1.0879 1.0898 1.0983 1.1038 1.0881 1.0995 1.0915 1.1009 1.0866 1.0869 1.0894 1.0991 1.0909 1.0876 1.0959 1.0949 1.1015 1.0949
irintensity: 0.0132 0.2084 0.0141 0.4462 0.0972 0.6210 0.5732 4.6871 1.7847 0.3397 2.3140 1.4925 0.6406 0.1973 0.6514 0.0307 0.2274 2.2021 1.6088 3.1181 8.2843 0.3183 4.2173 0.7513 0.0070 0.0595 0.3677 1.1159 0.2813 1.3914 5.5538 6.8331 10.8854 26.2601 13.5039 0.0763 1.2632 2.0097 21.8942 43.3362 7.1958 12.1829 23.9879 3.7553 10.3098 18.9804 0.2143 9.8989 64.0503 5.2859 0.2656 2.3522 3.5308 3.4536 0.1078 0.0793 63.3432 2.0625 1.8374 6.1834 36.6761 7.8951 5.0208 2.4250 11.1005 2.0685 3.8980 4.1571 3.1208 1.0437 27.0556 0.1612 30.4603 4.6883 28.7804 46.4377 11.0307 3.2050 0.8488 54.5553 0.2015 3.5206 4.6313 0.5968 185.8848 10.6153 2.8462 4.3293 13.6375 34.5432 13.8652 15.7198 6.3929 6.7975 0.1003 14.1380 13.4284 2.2115 9.1814 3.9263 0.4934 6.2360 2.7032 1.2747 11.1702 7.1569 0.2842 0.5917 31.3119 1.8625 13.2533 17.5550 56.3201 8.9958 8.7529 11.4387 15.3981 107.9938 8.8335 1.2013 15.5965 52.8911 56.1910 66.8290 49.7947 80.3976 42.7706 266.3158 68.7175 4.2037 45.6182 48.3149 51.2793 53.8361 0.9047 49.8159 26.6609 43.4385 32.4511 36.0641 9.8487 6.7623 15.0682 29.6924 11.8206 5.4739 46.6230 13.7859 27.8945 6.6776
temp: 298.150 k
press: 1.00000 atm
elementType: 8 7 7 6 6 6 6 6 6 6 6 6 6 6 6 6 6 6 6 6 6 6 6 6 1 1 1 1 1 1 1 1 1 1 1 1 1 1 1 1 1 1 1 1 1 1 1 1 1 1 1 1
symmnumber: 1
zpe: 1167830.1 jmol-1
zpe.correction: 0.444803 hartree
zpe.thermalcorrener: 0.467959 hartree
zpe.thermalcorrenthalpy: 0.468903 hartree
zpe.thermalcorrgfe: 0.389364 hartree
zpe.sumelectzpe: -999.916274 hartree
zpe.sumelectthermal: -999.893118 hartree
zpe.sumelectthermalent: -999.892174 hartree
zpe.sumelectthermalfe: -999.971713 hartree
dipole: 0.8384 0.1339 -1.7429
dipole: 1.9387
quadrupole: -142.9581 -136.8519 -136.9900
quadrupole: 5.4606 -3.7017 -9.7655
quadrupole: -4.0248 2.0814 1.9433 5.4606 -3.7017 -9.7655
hfenergy: -1000.3610771 hartree
pointgroup: C01 [X(C21H28N2O1)]
dipole: 0.3030632 0.0302271 -0.6992794 debye
polarizability: 251.2530953|21.5662864|271.9008271|0.5117055|-15.161446|204.4205061 unknown
InChI: InChI=1S/C21H28N2O/c1-22-14-16-23(17-15-22)21(13-8-18-6-4-3-5-7-18)19-9-11-20(24-2)12-10-19/h3-7,9-12,21H,8,13-17H2,1-2H3
charge 0 multiplicity 1
52 atoms
O  1.642391 5.06027 -0.019768
N  1.514694 -1.418535 -0.000977
N  3.600284 -3.446584 -0.245809
C  0.500856 -0.561404 0.697608
C  1.187802 -2.868478 -0.042365
C  2.86725 -1.235581 0.596131
C  2.256937 -3.640268 -0.835079
C  3.930563 -2.003641 -0.201037
C  -0.943205 -0.858247 0.199387
C  0.846455 0.916785 0.492146
C  -2.020793 0.049062 0.854873
C  4.635759 -4.244598 -0.927049
C  0.858784 1.829599 1.577173
C  1.117967 1.415141 -0.803978
C  -3.42316 -0.334094 0.404353
C  1.125117 3.198243 1.379026
C  1.388947 2.783872 -1.025482
C  1.388418 3.680638 0.073283
C  -3.968017 0.198051 -0.793571
C  -4.202645 -1.260862 1.144009
C  -5.251637 -0.186097 -1.242094
C  -5.487581 -1.648909 0.700582
C  -6.016782 -1.113304 -0.496435
C  1.918348 5.607388 -1.349104
H  0.516214 -0.768381 1.802428
H  0.218906 -3.016422 -0.547163
H  1.117548 -3.303086 0.987338
H  2.88688 -1.592122 1.65702
H  3.114205 -0.16004 0.593817
H  2.01209 -4.719367 -0.816938
H  2.224093 -3.297243 -1.902306
H  3.996692 -1.564734 -1.230565
H  4.915586 -1.878882 0.28728
H  -1.21193 -1.907424 0.422092
H  -0.975569 -0.737743 -0.901291
H  -1.939008 -0.040128 1.956702
H  -1.812876 1.104603 0.6021
H  4.77039 -3.970002 -2.005031
H  4.372524 -5.316857 -0.878766
H  5.606394 -4.107888 -0.416814
H  0.660708 1.464408 2.592656
H  1.142321 0.708329 -1.640898
H  1.137917 3.906404 2.213166
H  1.600492 3.134449 -2.040471
H  -3.382176 0.922887 -1.373014
H  -3.800701 -1.676557 2.07694
H  -5.657088 0.239238 -2.167533
H  -6.076189 -2.362861 1.288379
H  -7.013916 -1.410056 -0.840951
H  2.829646 5.157864 -1.79031
H  2.077128 6.684143 -1.189711
H  1.061967 5.454419 -2.034879
