program: Gaussian 09
title: 000218001
version: EM64L-G09RevD.01
frameworkgroup: C1[X(C11H12Cl3NO)]
method: RPBEPBE
basis: SDD
operation: Freq
keyword: #p
keyword: freq=noraman
keyword: PBEPBE/SDD
title: #p freq=noraman PBEPBE/SDD
converged: YES YES NO NO
title: Mulliken charges:
elementType: Cl Cl Cl O N C C C C C C C C C C C H H H H H H H H H H H H
charge: -0.016477 -0.004169 -0.078587 -0.276656 -0.357843 -0.219158 -0.434526 0.570975 -0.679812 -0.374381 -0.411544 0.292373 -0.087020 -0.211446 -0.120973 -0.665037 0.257982 0.195894 0.230737 0.320850 0.217509 0.221908 0.237038 0.260345 0.279031 0.260645 0.295697 0.296643
chargesum: 0.00000
title: Mulliken charges with hydrogens summed into heavy atoms:
elementType: Cl Cl Cl O N C C C C C C C C C C C
charge: -0.016477 -0.004169 -0.078587 -0.276656 -0.036993 0.038825 -0.007895 0.570975 -0.003356 -0.114036 -0.132513 0.292373 -0.087020 0.049199 -0.120973 -0.072696
polarizability: 1.88744888e+02 -1.25349293e+01 1.26266751e+02 1.12748327e+01 1.79541846e+01 1.50100516e+02
1716.lowfreq: -12.0350 -4.8331 0.0013 0.0016 0.0023 5.7427 16.0923 25.2563 38.4358
frequency: 15.8399 25.1728 38.2983 73.1205 82.2563 96.7267 109.1301 148.2743 155.0660 180.8566 198.1893 202.3058 244.6948 265.2945 318.8267 345.1386 355.7438 419.3407 424.0755 430.4149 448.8273 492.7209 557.6254 560.9515 634.6008 639.9797 648.3233 668.1648 679.8301 718.0411 781.7124 835.1697 852.3510 887.1919 907.9069 920.0235 936.7826 969.3668 1002.3760 1040.8353 1061.7821 1100.0829 1107.1139 1124.3118 1149.8969 1157.8338 1204.6116 1238.2356 1249.3339 1253.0809 1256.1418 1305.6374 1326.6907 1347.7073 1373.9222 1395.8889 1404.3976 1418.3576 1458.8615 1477.3431 1479.4053 1489.4387 1496.6112 1568.9642 1593.5437 1598.0030 2975.1851 2986.9892 3022.2089 3039.6730 3072.0252 3081.6460 3090.5760 3149.0130 3154.1687 3156.3253 3172.4973 3494.9502
redmass: 9.1460 16.3204 7.0469 3.6106 4.9516 2.9860 6.1812 3.7750 3.1995 10.6199 5.3608 2.6652 2.0530 3.3406 5.9798 5.3914 8.3023 7.8445 4.8583 3.9691 3.7481 3.9366 3.5786 4.9710 2.0234 2.8357 2.0576 5.8288 6.1527 3.1295 1.7334 1.3770 2.2776 1.6063 1.7311 2.4726 2.4519 1.3790 5.2390 4.4310 1.9237 2.4095 1.9410 2.6152 1.1300 1.4945 2.2688 1.5250 1.3471 1.3689 1.2996 1.3837 1.9274 1.5901 5.2401 1.2560 1.7372 1.0932 2.6183 1.0545 1.0493 1.0771 2.0202 7.4248 6.5019 9.1073 1.0644 1.0363 1.0852 1.0957 1.0566 1.0999 1.0998 1.0899 1.1093 1.0911 1.0965 1.0777
irintensity: 0.6639 0.0874 1.0407 2.1484 5.1141 12.7451 1.4332 0.1362 0.5004 1.4832 5.0784 3.4978 0.0946 9.1676 0.7032 1.5763 1.5455 1.9974 14.2978 4.8011 13.5551 7.0335 12.1087 14.3651 24.2802 47.2891 35.8030 13.9294 75.4617 26.9264 20.0784 27.8242 18.8038 11.6501 8.6001 27.6346 7.0520 0.7636 34.4091 2.5400 5.7325 12.8674 8.9500 22.7006 0.7399 4.2335 33.9783 9.1495 2.4721 15.9279 8.9961 46.0426 10.6977 9.9131 3.3448 11.3090 16.6659 36.3995 57.4831 8.4554 6.9582 13.4992 283.2665 22.4025 3.1517 185.1324 25.4340 25.6589 9.1505 18.8468 3.3605 33.6979 48.6593 0.2866 0.8105 1.6363 1.1123 45.6292
temp: 298.150 k
press: 1.00000 atm
elementType: 17 17 17 8 7 6 6 6 6 6 6 6 6 6 6 6 1 1 1 1 1 1 1 1 1 1 1 1
symmnumber: 1
zpe: 546358.5 jmol-1
zpe.correction: 0.208097 hartree
zpe.thermalcorrener: 0.225004 hartree
zpe.thermalcorrenthalpy: 0.225948 hartree
zpe.thermalcorrgfe: 0.160020 hartree
zpe.sumelectzpe: -1935.350476 hartree
zpe.sumelectthermal: -1935.333569 hartree
zpe.sumelectthermalent: -1935.332624 hartree
zpe.sumelectthermalfe: -1935.398552 hartree
dipole: -2.0404 1.9469 0.0312
dipole: 2.8204
quadrupole: -125.2443 -109.3988 -120.4183
quadrupole: -1.4450 -4.2901 2.2910
quadrupole: -6.8905 8.9550 -2.0645 -1.4450 -4.2901 2.2910
hfenergy: -1935.5585725 hartree
pointgroup: C01 [X(C11H12Cl3N1O1)]
dipole: -0.7427911 0.7321833 0.3787324 debye
polarizability: 189.4469515|-15.7003368|118.2044607|2.0510742|8.7620125|157.4607427 unknown
InChI: InChI=1S/C11H12Cl3NO/c1-2-10(15-11(16)6-12)7-3-4-8(13)9(14)5-7/h3-5,10,15H,2,6H2,1H3
charge 0 multiplicity 1
28 atoms
Cl 3.883368 -0.590638 1.658315
Cl 4.364737 -1.604288 -1.43743
Cl -3.639254 -1.950373 1.993833
O  -2.776246 -0.239289 -1.607583
N  -1.922232 0.092468 0.542385
C  -0.948517 1.141571 0.14078
C  -0.888596 2.234945 1.232801
C  0.400581 0.500247 -0.223033
C  -0.031905 3.450949 0.822413
C  1.416092 0.28982 0.740179
C  0.6195 0.059267 -1.553004
C  -2.746488 -0.514742 -0.364972
C  2.619188 -0.349776 0.381267
C  1.823855 -0.579114 -1.912965
C  2.828414 -0.785198 -0.944154
C  -3.710419 -1.59415 0.128915
H  -1.363734 1.585631 -0.783266
H  -0.506417 1.809737 2.183479
H  -1.926273 2.561836 1.434964
H  -1.946458 -0.226474 1.516509
H  -0.418043 3.910985 -0.105991
H  -0.046489 4.222569 1.612315
H  1.020069 3.166723 0.644842
H  1.290452 0.61843 1.776489
H  -0.166946 0.200426 -2.301999
H  1.991764 -0.919792 -2.938654
H  -4.746069 -1.291008 -0.082023
H  -3.485432 -2.549059 -0.367813
