program: Gaussian 09
title: 000224643
version: EM64L-G09RevD.01
frameworkgroup: C1[X(C19H31Cl2NO)]
method: RPBEPBE
basis: SDD
operation: Freq
keyword: #p
keyword: freq=noraman
keyword: PBEPBE/SDD
title: #p freq=noraman PBEPBE/SDD
converged: YES YES NO NO
title: Mulliken charges:
elementType: Cl Cl O N C C C C C C C C C C C C C C C C C C C H H H H H H H H H H H H H H H H H H H H H H H H H H H H H H H
charge: -0.053962 -0.054296 -0.443158 -0.109206 -0.378352 -0.363640 -0.399151 -0.384728 -0.371064 -0.258873 -0.323659 -0.337742 0.648662 -0.351683 -0.356779 -0.577685 -0.399340 -0.702821 -0.696123 0.626106 -0.252557 -0.350345 -0.789108 0.197873 0.198420 0.201956 0.182497 0.227197 0.226901 0.189254 0.195443 0.183505 0.210941 0.226381 0.222583 0.171553 0.184060 0.182233 0.186593 0.202506 0.194363 0.198779 0.279028 0.344025 0.215232 0.206062 0.215577 0.210040 0.209336 0.215538 0.260045 0.249878 0.249451 0.242250
chargesum: 0.00000
title: Mulliken charges with hydrogens summed into heavy atoms:
elementType: Cl Cl O N C C C C C C C C C C C C C C C C C C C
charge: -0.053962 -0.054296 -0.099133 -0.109206 0.017942 0.020813 0.054947 -0.000030 0.023383 -0.032491 0.070477 0.028552 0.648662 0.037416 0.036364 -0.577685 -0.120313 -0.065949 -0.061210 0.626106 0.007488 -0.350345 -0.047529
polarizability: 2.71860911e+02 1.91622474e+01 2.23269952e+02 -1.44879890e+01 2.02968708e+01 2.02047626e+02
1716.lowfreq: -15.0096 -5.0127 -0.0019 -0.0018 -0.0018 4.8821 13.6577 24.3824 28.3281
frequency: 11.0765 23.4792 28.2108 35.0094 42.7425 45.7410 49.4680 69.2885 80.7936 84.2718 98.9240 100.6891 105.0715 126.9391 130.7815 144.5884 152.8404 171.9655 202.9775 223.2003 225.5401 232.9690 241.5588 253.5326 262.5016 279.6302 287.7395 298.2610 323.2290 336.4755 345.8898 366.1819 387.1447 391.3676 414.3543 435.5860 455.3271 503.8507 519.4174 535.1497 556.6800 577.3287 600.4467 669.3696 725.0405 727.6921 742.2871 750.5530 752.6873 763.6839 814.3878 824.9686 844.7338 846.6967 885.5487 891.0915 914.6535 922.9498 950.9785 957.7233 962.0659 984.9345 996.0875 1010.2895 1016.1607 1026.8400 1041.1383 1041.7272 1050.6914 1052.5283 1076.2538 1079.8810 1093.7636 1104.1095 1112.8581 1118.6144 1140.0486 1153.4512 1184.6635 1204.5825 1208.1569 1216.3836 1225.9488 1237.3221 1250.9188 1252.3986 1268.0798 1273.0648 1280.3651 1285.2254 1285.9906 1290.0662 1300.0168 1304.4772 1322.1619 1335.9837 1339.8916 1352.7705 1356.0225 1356.9650 1363.3258 1371.9763 1378.8767 1385.9942 1388.6722 1395.9751 1400.7494 1434.5620 1455.8515 1463.9407 1465.5866 1467.2668 1468.0118 1468.7048 1473.1406 1473.8158 1474.7816 1476.0066 1476.4076 1477.3273 1482.1238 1486.5980 1488.6795 1570.6085 1590.3969 2844.4114 2864.6564 2904.1118 2951.0067 2955.5983 2961.2098 2967.2346 2967.7265 2970.2406 2971.4999 2977.5358 2992.2728 2993.0460 3004.0698 3009.0105 3009.3831 3012.5957 3022.3127 3032.8787 3042.8130 3050.4225 3052.1422 3065.4157 3068.2273 3068.9119 3070.2865 3070.3732 3123.1183 3147.7172 3174.4946 3562.1165
redmass: 6.0781 3.8400 3.9106 5.3991 3.1449 2.6541 2.4186 1.6104 3.8403 1.3189 3.5991 2.6238 2.9441 2.6405 1.9083 2.5419 7.4468 3.2042 11.4286 1.4858 1.2671 2.5920 2.0065 3.7146 2.8133 4.3357 2.8543 3.3724 1.4497 2.3501 4.0672 5.3196 2.5099 6.7831 2.8413 2.8605 3.6012 2.8665 4.5416 3.4277 4.1624 6.0324 3.5515 4.1209 1.1381 1.0854 4.5539 4.7661 1.2888 1.3812 1.8746 1.3887 1.2761 1.7068 3.4176 1.9656 1.7636 1.5757 3.2332 1.3615 1.2507 1.9326 1.7718 2.9151 2.7747 2.5051 4.3974 1.6192 2.5613 2.5342 2.3655 2.2665 2.0360 2.1414 1.9039 2.1814 1.7101 1.4647 2.0224 1.6791 1.4917 1.4479 1.4864 1.3236 1.8006 1.5035 1.6459 1.2325 1.1946 1.1155 1.0888 1.1821 1.1965 1.4078 1.4167 1.4661 1.4759 1.6157 1.7093 4.2903 1.3494 1.3834 1.4363 1.2233 1.2195 2.7719 1.2877 2.2079 1.0832 1.0718 1.0754 1.0883 1.0691 1.1521 1.0807 1.0781 1.0880 1.0479 1.0427 1.0699 1.0759 1.0872 1.0913 6.1168 8.6088 1.0709 1.0713 1.0696 1.0587 1.0632 1.0605 1.0609 1.0582 1.0363 1.0373 1.0636 1.0963 1.0386 1.0922 1.0985 1.0855 1.0857 1.1018 1.0906 1.0999 1.1008 1.0919 1.1004 1.1007 1.0972 1.0992 1.0992 1.0978 1.0886 1.0965 1.0662
irintensity: 0.0175 0.0051 0.0367 0.0972 0.2257 0.0089 0.0826 0.0756 0.1316 0.0004 0.1335 1.0648 1.5044 0.1626 0.0739 0.5286 1.4327 0.4269 0.9784 0.2995 0.1958 0.4914 0.4023 10.6669 0.2960 2.8334 0.6273 1.0534 106.3514 47.4119 3.6281 10.0300 0.1750 13.1672 2.5704 3.6581 4.9566 1.7701 0.4025 0.5664 5.7496 8.7394 13.8955 11.3427 5.7159 17.9030 1.8199 34.4543 3.1497 3.1773 9.4861 42.2565 5.8364 4.2545 7.8885 12.3302 4.4863 16.7621 53.2388 0.3853 7.9520 59.4449 18.8265 13.1036 12.8441 6.7592 26.0191 6.7318 4.7829 1.6751 2.3510 15.5246 24.7930 20.0523 6.2440 6.3513 7.7817 10.3685 6.5607 5.6078 1.3950 28.0140 11.1795 12.1677 2.8987 1.3406 6.9987 2.3819 3.0103 2.0151 0.8645 2.5506 2.4339 18.1744 10.8957 13.7702 17.2632 0.3751 5.1119 18.0880 6.6293 4.6224 1.7036 8.4121 12.2322 42.8295 13.7361 12.2786 1.6766 0.6676 0.2746 23.0907 5.8775 26.7782 4.3617 3.1597 7.1880 6.7754 11.2642 7.6283 1.9653 21.2628 18.7802 31.8676 9.7037 81.0250 127.7224 97.9607 18.7308 8.7176 4.4275 107.0843 39.8117 26.1086 35.2507 46.4403 5.9321 10.4109 15.9986 5.5370 11.3067 24.3045 9.8407 15.7824 41.0702 75.7761 34.5759 123.0923 110.3500 6.0220 44.2584 51.1487 6.1885 0.5760 1.6050 8.9196
temp: 298.150 k
press: 1.00000 atm
elementType: 17 17 8 7 6 6 6 6 6 6 6 6 6 6 6 6 6 6 6 6 6 6 6 1 1 1 1 1 1 1 1 1 1 1 1 1 1 1 1 1 1 1 1 1 1 1 1 1 1 1 1 1 1 1
symmnumber: 1
zpe: 1209558.5 jmol-1
zpe.correction: 0.460696 hartree
zpe.thermalcorrener: 0.488617 hartree
zpe.thermalcorrenthalpy: 0.489561 hartree
zpe.thermalcorrgfe: 0.398623 hartree
zpe.sumelectzpe: -1790.878314 hartree
zpe.sumelectthermal: -1790.850393 hartree
zpe.sumelectthermalent: -1790.849449 hartree
zpe.sumelectthermalfe: -1790.940387 hartree
dipole: 0.5954 0.4078 0.0684
dipole: 0.7249
quadrupole: -158.4012 -158.8977 -151.5972
quadrupole: -4.6324 0.9523 -1.3890
quadrupole: -2.1025 -2.5990 4.7015 -4.6324 0.9523 -1.3890
hfenergy: -1791.3390104 hartree
pointgroup: C01 [X(C19H31Cl2N1O1)]
dipole: 0.2311795 0.010797 -0.166682 debye
polarizability: 271.1143506|-16.749258|198.3951606|-18.5362622|-17.5232267|227.6689777 unknown
InChI: InChI=1S/C19H31Cl2NO/c1-4-6-8-12-22(13-9-7-5-2)14-18(23)16-10-11-17(20)15(3)19(16)21/h10-11,18,23H,4-9,12-14H2,1-3H3
charge 0 multiplicity 1
54 atoms
Cl 0.164074 -2.400548 0.080558
Cl -4.993084 -0.640942 1.34448
O  -0.596234 -0.609341 -3.859319
N  1.286463 1.128411 -1.141184
C  1.249021 2.556396 -0.721794
C  2.649067 0.532878 -1.116682
C  0.576899 0.884423 -2.414945
C  -0.080687 2.955171 -0.040707
C  3.159457 0.222458 0.305913
C  -0.128384 -0.494555 -2.458901
C  -0.297111 2.257266 1.318936
C  4.567409 -0.414677 0.303857
C  -1.301968 -0.591687 -1.49105
C  -1.677319 2.555397 1.94719
C  5.082072 -0.744983 1.723704
C  -1.309871 -1.375849 -0.317829
C  -2.477448 0.150428 -1.776905
C  -1.895877 1.82768 3.291209
C  6.487319 -1.384405 1.723216
C  -2.395528 -1.445221 0.599755
C  -3.587939 0.122152 -0.91602
C  -3.524348 -0.66347 0.25182
C  -2.326619 -2.297046 1.847583
H  2.073077 2.722724 -0.003363
H  1.445408 3.234984 -1.589502
H  2.615254 -0.416522 -1.685277
H  3.389574 1.188055 -1.645184
H  1.256235 0.929947 -3.298785
H  -0.192968 1.662656 -2.562881
H  -0.090098 4.057173 0.093506
H  -0.930165 2.714983 -0.712495
H  3.184243 1.149139 0.914188
H  2.434333 -0.456435 0.794087
H  0.60538 -1.292448 -2.234369
H  -0.177379 1.166354 1.172782
H  0.502114 2.570759 2.024445
H  4.551981 -1.345093 -0.302426
H  5.286544 0.269257 -0.194932
H  -1.7886 3.649803 2.095172
H  -2.471557 2.254588 1.233999
H  5.09731 0.183559 2.33047
H  4.363057 -1.427833 2.220307
H  -2.506246 0.743237 -2.697066
H  -1.0806 -1.467367 -3.963866
H  -1.830253 0.730894 3.158191
H  -1.128653 2.12239 4.032356
H  -2.889072 2.055266 3.720202
H  6.492174 -2.329714 1.147956
H  7.230923 -0.707844 1.260825
H  6.829902 -1.611883 2.749564
H  -4.489822 0.697751 -1.140556
H  -2.15522 -3.357591 1.589453
H  -1.481226 -1.984441 2.487174
H  -3.255313 -2.222583 2.43184
