program: Gaussian 09
title: 000224612
version: EM64L-G09RevD.01
frameworkgroup: C1[X(C16H20ClN3)]
method: RPBEPBE
basis: SDD
operation: Freq
keyword: #p
keyword: freq=noraman
keyword: PBEPBE/SDD
title: #p freq=noraman PBEPBE/SDD
converged: YES YES NO NO
title: Mulliken charges:
elementType: Cl N N N C C C C C C C C C C C C C C C C H H H H H H H H H H H H H H H H H H H H
charge: -0.060721 -0.059517 -0.433155 -0.047935 -0.083154 -0.487347 -0.419420 -0.377986 -0.386609 -0.288722 0.370345 -0.705317 0.263199 -0.327748 -0.030090 -0.333310 -0.389211 -0.295592 -0.276649 -0.090232 0.243759 0.217210 0.223112 0.213760 0.223169 0.153341 0.228794 0.219657 0.188681 0.298498 0.175516 0.210403 0.229977 0.214005 0.217400 0.231733 0.195809 0.233379 0.286530 0.254437
chargesum: 0.00000
title: Mulliken charges with hydrogens summed into heavy atoms:
elementType: Cl N N N C C C C C C C C C C C C C C C C
charge: -0.060721 -0.059517 -0.134657 -0.047935 0.160605 -0.047024 0.017509 0.004149 0.021729 0.097197 0.370345 -0.043935 0.263199 -0.096015 -0.030090 -0.137501 -0.155832 -0.009062 -0.022212 -0.090232
polarizability: 2.86525308e+02 1.90732573e+01 2.24022772e+02 1.42366628e+01 -1.19390474e+01 1.25831024e+02
1716.lowfreq: -7.6780 -0.4055 -0.0017 0.0010 0.0013 8.9993 23.9916 37.1139 48.4411
frequency: 23.2886 36.7785 48.2786 71.2983 90.5115 109.0913 124.7583 153.7239 189.5634 208.0898 228.6904 246.4493 251.9882 269.7208 277.8437 325.5537 357.2043 368.5440 390.1013 395.7886 426.8587 434.6319 462.2408 476.6799 502.4572 505.6122 522.9361 576.7571 615.2477 635.5223 642.9385 665.9477 729.9235 745.5319 757.0958 796.9836 803.2203 806.2723 819.5615 833.1655 849.6216 866.6612 896.5753 909.0836 929.8943 933.4372 948.4120 964.6733 1005.7009 1014.4008 1050.7037 1059.5847 1062.9895 1067.7084 1090.4041 1106.6937 1125.0211 1138.2195 1143.4703 1153.0264 1170.0573 1186.5864 1208.5319 1233.4739 1242.4397 1251.7568 1286.8223 1293.8927 1299.5481 1313.8461 1325.1023 1333.8484 1340.7408 1350.5111 1358.1550 1366.3184 1371.3575 1389.8886 1391.3189 1395.1940 1416.3452 1439.8398 1442.9401 1454.0345 1461.3001 1464.9121 1471.8207 1475.8852 1479.6125 1493.1733 1530.1096 1557.9929 1581.8876 1609.2766 2765.2846 2829.8757 2845.5553 2978.8869 2987.1161 2997.7570 3005.2709 3015.2297 3031.2648 3051.2721 3062.0721 3067.1806 3080.3416 3091.2180 3116.3172 3117.1947 3172.5355 3173.7331 3182.7890 3567.3872
redmass: 4.8674 4.5768 3.4154 3.7583 3.5510 2.3530 3.9449 4.1523 2.9432 2.6397 2.9010 4.4241 1.9623 3.0397 3.9254 2.3332 2.9646 1.6680 2.0041 4.2567 2.7054 2.2191 3.9143 3.8229 3.0990 2.6747 6.0475 7.6853 5.7298 4.3393 3.9754 3.0500 2.9287 4.4760 1.8000 1.5305 1.1683 2.2346 1.5959 5.7444 3.0637 5.3352 1.5012 2.2792 1.3563 2.1887 1.4149 3.0165 1.5235 2.1822 2.4004 2.0035 2.0288 2.0656 2.1302 2.3839 1.6815 2.5980 1.8325 1.9214 1.5685 1.1828 2.1907 1.7747 1.4405 1.3234 1.2070 1.4893 1.5253 1.6636 1.7211 1.8192 1.4327 1.3881 1.6665 1.4383 2.0938 1.2414 4.3070 1.4376 2.7232 2.4515 1.0938 1.0939 1.0866 1.5290 1.1616 1.2720 1.0716 1.0787 4.7599 3.7307 6.6297 6.6295 1.0714 1.0711 1.0707 1.0799 1.0358 1.0609 1.0674 1.0876 1.0867 1.0858 1.1019 1.1015 1.0983 1.1004 1.0884 1.0898 1.0934 1.0949 1.0932 1.0757
irintensity: 0.1847 1.1885 0.1415 0.1608 0.2292 0.4500 0.0650 1.3784 0.7012 1.9450 1.2554 0.4144 1.3231 2.5665 1.3207 1.3542 8.6417 7.9182 25.4746 2.1813 12.7275 39.2981 3.6448 8.1928 5.1044 7.1682 2.6512 10.6842 1.1876 11.2716 8.0364 9.7541 4.7423 2.3610 18.0873 2.1787 1.8603 40.5355 23.4693 45.5228 5.0924 48.1360 25.2145 2.2998 0.1652 9.9252 2.0983 5.3097 2.0322 21.0030 4.0801 8.8414 4.6095 12.4417 16.3093 8.0418 16.5679 18.5995 21.4128 58.6510 2.0014 14.3434 14.6337 18.0608 1.8648 13.2168 7.7647 27.3423 26.0978 7.4569 1.0917 75.7688 18.5534 1.1605 15.0380 3.1360 3.9937 18.7395 77.4369 20.4699 9.6432 53.2870 18.9441 11.6403 3.2758 62.2761 31.5739 4.8843 3.7772 12.6716 112.9705 201.5834 359.4168 80.6869 132.1379 43.0748 177.1370 9.4166 28.1569 20.7025 54.6678 15.2749 50.3558 41.1701 16.1039 58.0599 54.0206 33.2638 17.3740 30.5365 23.9814 4.8608 0.7830 44.0282
temp: 298.150 k
press: 1.00000 atm
elementType: 17 7 7 7 6 6 6 6 6 6 6 6 6 6 6 6 6 6 6 6 1 1 1 1 1 1 1 1 1 1 1 1 1 1 1 1 1 1 1 1
symmnumber: 1
zpe: 869505.3 jmol-1
zpe.correction: 0.331177 hartree
zpe.thermalcorrener: 0.349574 hartree
zpe.thermalcorrenthalpy: 0.350518 hartree
zpe.thermalcorrgfe: 0.283562 hartree
zpe.sumelectzpe: -1244.536818 hartree
zpe.sumelectthermal: -1244.518421 hartree
zpe.sumelectthermalent: -1244.517477 hartree
zpe.sumelectthermalfe: -1244.584433 hartree
dipole: 6.6185 -1.3428 1.0725
dipole: 6.8379
quadrupole: -144.1998 -123.1456 -127.0732
quadrupole: 0.7647 -1.1705 -0.7034
quadrupole: -12.7270 8.3273 4.3997 0.7647 -1.1705 -0.7034
hfenergy: -1244.8679949 hartree
pointgroup: C01 [X(C16H20Cl1N3)]
dipole: -2.6320492 0.3447653 0.4369495 debye
polarizability: 283.2409651|23.2473773|227.317208|-16.4625218|9.5407518|125.8209312 unknown
InChI: InChI=1S/C16H20ClN3/c1-2-20-9-6-13(7-10-20)19-15-5-8-18-16-11-12(17)3-4-14(15)16/h3-5,8,11,13,19H,2,6-7,9-10H2,1H3
charge 0 multiplicity 1
40 atoms
Cl 5.485369 2.701826 -0.238058
N  -4.103846 0.347194 -0.346958
N  -0.640376 -0.446145 0.660233
N  3.207836 -1.95458 -0.49224
C  -1.870951 -1.253698 0.791394
C  -2.8958 -0.492797 1.665204
C  -2.519194 -1.573894 -0.584934
C  -3.485973 0.736332 0.94006
C  -3.110255 -0.310132 -1.237258
C  -4.783136 1.47699 -1.035199
C  0.595813 -0.932604 0.278949
C  -6.00356 2.020589 -0.270243
C  1.73968 -0.034255 0.16792
C  0.819086 -2.300207 -0.008547
C  3.013843 -0.603901 -0.221863
C  1.668422 1.371852 0.421173
C  2.118096 -2.743426 -0.37555
C  4.157605 0.251894 -0.342583
C  2.791286 2.197007 0.300268
C  4.029532 1.611522 -0.084647
H  -1.603913 -2.201515 1.299797
H  -2.428033 -0.183193 2.619429
H  -3.725445 -1.182427 1.90354
H  -3.328451 -2.312299 -0.427705
H  -1.772664 -2.023999 -1.264655
H  -2.691989 1.523199 0.787989
H  -4.25412 1.193998 1.586583
H  -3.619011 -0.585286 -2.179476
H  -2.276734 0.391338 -1.50732
H  -0.734044 0.552357 0.84108
H  -4.06629 2.3151 -1.242272
H  -5.119326 1.097959 -2.019209
H  -6.69501 1.196918 -0.019376
H  -5.721046 2.534326 0.666025
H  -6.545321 2.753318 -0.895596
H  0.010686 -3.032595 0.047361
H  0.726402 1.847645 0.719348
H  2.275874 -3.807908 -0.58988
H  5.105196 -0.20502 -0.637949
H  2.727463 3.270812 0.496064
