program: Gaussian 09
title: 000224611
version: EM64L-G09RevD.01
frameworkgroup: C1[X(C16H13NO3S)]
method: RPBEPBE
basis: SDD
operation: Freq
keyword: #p
keyword: freq=noraman
keyword: PBEPBE/SDD
title: #p freq=noraman PBEPBE/SDD
converged: YES YES NO NO
title: Mulliken charges:
elementType: S O O O N C C C C C C C C C C C C C C C C H H H H H H H H H H H H H
charge: 0.247606 -0.243115 -0.412555 -0.245629 -0.351503 0.463818 0.496080 -0.348971 -0.341130 0.172754 -0.501178 -0.305792 -0.301158 -0.497079 -0.260457 -0.262806 -0.233813 -0.230125 -0.239508 -0.238185 0.189710 0.266072 0.262375 0.258743 0.273422 0.260717 0.297042 0.254160 0.251311 0.237893 0.233528 0.237012 0.233963 0.376797
chargesum: 0.00000
title: Mulliken charges with hydrogens summed into heavy atoms:
elementType: S O O O N C C C C C C C C C C C C C C C C
charge: 0.247606 -0.243115 -0.035758 -0.245629 -0.351503 0.463818 0.496080 -0.348971 -0.341130 0.172754 0.027270 -0.047049 -0.027736 0.060680 -0.006297 -0.011495 0.004080 0.003403 -0.002496 -0.004222 0.189710
polarizability: 2.26254944e+02 2.77582024e+01 2.34363512e+02 -2.59633282e+01 7.65220536e+00 1.49209946e+02
1716.lowfreq: -4.5929 -0.0005 0.0013 0.0013 3.0273 4.3826 24.4694 35.6446 46.0943
frequency: 24.4597 35.6356 46.0892 61.0185 75.4117 89.1477 100.3894 127.9510 155.5441 167.0789 199.0661 246.9907 263.2186 310.7473 329.7465 359.2191 370.3587 394.9096 422.2201 441.1632 460.0187 466.0517 511.4305 515.1070 522.9072 528.6293 574.8772 594.4859 628.4018 646.8277 652.1754 672.0580 684.1540 717.6442 727.0681 746.8458 757.2653 764.8020 799.3461 858.9635 864.3529 883.1566 897.8597 940.2901 945.4376 962.4836 983.5616 983.9721 1014.8544 1020.7670 1030.6174 1039.8343 1051.5990 1059.0546 1094.4200 1122.3731 1130.1766 1156.4402 1172.3092 1173.6597 1179.5523 1235.3913 1239.1546 1250.1786 1260.7085 1277.3622 1294.1563 1337.3447 1371.2394 1375.9723 1380.0324 1426.3281 1431.5151 1441.8637 1452.4861 1453.4440 1468.3522 1572.8214 1585.2097 1586.9452 1590.9842 1607.5927 1661.1718 2996.0858 3005.2700 3062.5544 3082.1191 3137.3554 3137.9282 3147.1920 3150.4711 3158.7481 3167.2060 3173.5663 3191.7927 3512.7380
redmass: 7.6106 9.4589 6.3948 6.4421 5.4474 4.5646 2.9023 3.0771 5.0626 5.1774 5.8687 5.6806 6.7353 5.5577 5.1676 9.4510 6.6074 7.6726 8.0592 3.3985 3.6306 3.9572 2.5572 3.6380 3.6220 4.3901 3.6559 4.2760 4.3453 2.8233 2.2023 6.3060 6.0952 4.4001 4.2762 5.2269 1.2509 1.3558 1.7045 1.3996 1.3673 4.8439 4.0783 1.4674 1.3829 5.0738 1.3235 1.3246 2.1878 5.3787 2.8358 2.9276 2.4525 3.2576 2.4378 1.6654 1.6838 1.3574 1.1284 1.0636 1.7315 1.6373 1.4921 2.0871 1.4234 1.7311 2.3096 1.9024 6.0940 2.3318 10.9625 2.1970 2.2529 1.0765 1.1933 2.2316 2.6086 6.6817 6.5155 7.2917 7.9896 7.4447 8.0538 1.0647 1.0627 1.0950 1.0973 1.0858 1.0855 1.0898 1.0916 1.0951 1.0982 1.1009 1.0962 1.0639
irintensity: 0.2610 1.6345 0.5559 2.7495 0.0367 3.0091 0.6110 1.3645 2.2770 4.8397 1.7345 0.1124 7.5993 1.5773 1.7836 0.3119 3.0142 0.2748 5.5901 0.2328 31.9457 14.8246 42.7743 10.6471 0.7660 48.5407 22.5754 6.4688 32.8061 34.6182 61.1184 11.9252 7.2879 1.7473 8.8421 10.8884 28.8660 114.0661 13.9909 2.0123 0.3495 3.1781 5.6026 0.3242 2.2386 4.4420 0.1142 0.0200 62.1660 28.1004 5.2596 49.0417 69.8503 81.7365 83.1087 10.2952 14.9835 16.7484 8.8500 1.4497 54.2994 6.5661 27.3617 239.9643 11.9680 11.1729 21.5561 245.0926 14.3499 4.9410 2.2527 9.5479 21.8444 15.8140 4.3751 181.8736 33.2709 71.5716 1.6319 66.4803 76.3094 39.0998 185.3047 16.6949 32.8334 3.2666 6.6945 1.1838 0.2009 4.6398 9.9923 15.3812 26.2591 16.9633 2.4865 25.5365
temp: 298.150 k
press: 1.00000 atm
elementType: 16 8 8 8 7 6 6 6 6 6 6 6 6 6 6 6 6 6 6 6 6 1 1 1 1 1 1 1 1 1 1 1 1 1
symmnumber: 1
zpe: 663804.7 jmol-1
zpe.correction: 0.252830 hartree
zpe.thermalcorrener: 0.271014 hartree
zpe.thermalcorrenthalpy: 0.271959 hartree
zpe.thermalcorrgfe: 0.204680 hartree
zpe.sumelectzpe: -1294.532374 hartree
zpe.sumelectthermal: -1294.514189 hartree
zpe.sumelectthermalent: -1294.513245 hartree
zpe.sumelectthermalfe: -1294.580523 hartree
dipole: -1.1102 2.3231 -0.2930
dipole: 2.5914
quadrupole: -116.3896 -122.5155 -127.5177
quadrupole: 3.5788 2.6120 2.5747
quadrupole: 5.7513 -0.3746 -5.3768 3.5788 2.6120 2.5747
hfenergy: -1294.7852036 hartree
pointgroup: C01 [X(C16H13N1O3S1)]
dipole: -0.5932053 0.8263965 0.0678546 debye
polarizability: 215.2023969|29.9820858|239.1888834|-23.4956886|20.0182694|155.4371215 unknown
InChI: InChI=1S/C16H13NO3S/c18-15(9-10-16(19)20)17-11-5-1-3-7-13(11)21-14-8-4-2-6-12(14)17/h1-8,19H,9-10H2
charge 0 multiplicity 1
34 atoms
S  -2.13149 0.062617 1.997466
O  1.317534 -2.069129 -0.705636
O  5.779601 -0.531325 1.159049
O  4.983391 1.021939 -0.369469
N  -0.202815 -0.340546 -0.303709
C  -0.486995 1.055135 -0.051394
C  -1.34585 -1.231098 -0.383771
C  -1.37332 1.402234 1.000206
C  -2.33992 -1.143819 0.622321
C  1.111375 -0.865891 -0.374463
C  2.26766 0.07009 0.000042
C  0.051673 2.077637 -0.868895
C  -1.493256 -2.169646 -1.430655
C  3.47672 -0.743833 0.496391
C  -1.667154 2.75519 1.274058
C  -3.469169 -1.988798 0.59463
C  -0.222878 3.432022 -0.583849
C  -2.611542 -3.030653 -1.447928
C  -1.073738 3.772639 0.494042
C  -3.597727 -2.944246 -0.437912
C  4.771328 0.027213 0.361254
H  1.949841 0.813189 0.750882
H  2.582947 0.64783 -0.890031
H  0.683247 1.808194 -1.721233
H  -0.721247 -2.238477 -2.199463
H  3.355939 -1.075506 1.541696
H  3.556687 -1.67062 -0.106507
H  -2.36066 3.006753 2.083015
H  -4.237054 -1.898055 1.369665
H  0.215093 4.216411 -1.209432
H  -2.712107 -3.767131 -2.251906
H  -1.29383 4.822615 0.712978
H  -4.467652 -3.609093 -0.456697
H  6.626765 -0.028038 1.014558
