program: Gaussian 09
title: 000224608
version: EM64L-G09RevD.01
frameworkgroup: C1[X(C15H29N5)]
method: RPBEPBE
basis: SDD
operation: Freq
keyword: #pfreq=noraman
keyword: PBEPBE/SDD
title: #p freq=noraman PBEPBE/SDD
converged: YES YES NO NO
title: Mulliken charges:
elementType: N N N N N C C C C C C C C C C C C C C C H H H H H H H H H H H H H H H H H H H H H H H H H H H H H
charge: -0.103188 -0.310991 -0.095741 -0.049406 -0.591198 -0.417479 -0.030897 -0.364973 -0.358056 -0.724764 -0.325369 -0.322573 -0.499666 0.327632 -0.677751 -0.671891 0.109820 -0.417748 -0.792770 -0.035008 0.190053 0.184623 0.196446 0.182672 0.236790 0.176904 0.199981 0.245773 0.206266 0.221596 0.218629 0.205424 0.183402 0.201404 0.183841 0.209320 0.186632 0.228679 0.207195 0.203601 0.228994 0.209324 0.202583 0.242092 0.247249 0.270236 0.226442 0.327878 0.327991
chargesum: 0.00000
title: Mulliken charges with hydrogens summed into heavy atoms:
elementType: N N N N N C C C C C C C C C C C C C C C
charge: -0.103188 -0.065218 -0.095741 -0.049406 0.064671 -0.042804 0.165549 0.054490 0.018830 -0.078273 0.063457 0.062671 -0.103714 0.327632 -0.038277 -0.030990 0.109820 -0.175656 -0.048844 -0.035008
polarizability: 2.33162484e+02 1.82704021e+01 2.17128375e+02 2.32411263e+01 -3.25265538e-01 1.62085334e+02
1716.lowfreq: -14.5763 -7.5027 -0.0005 0.0005 0.0007 3.5908 10.5611 16.8141 22.6980
frequency: 9.3077 16.0234 22.4864 43.7785 45.7020 59.4292 76.7322 83.2214 93.1363 113.4205 122.1569 139.7286 141.4303 177.3103 187.0479 204.5723 212.2071 216.0001 225.8255 265.5264 281.1715 287.5746 300.7719 315.3160 335.9841 390.1223 412.0645 439.3568 440.9944 458.9254 465.2705 469.4901 502.1123 505.9249 539.5078 542.7964 574.4071 629.8133 664.8106 733.9798 736.6242 748.9040 776.7967 793.5340 796.8996 798.6927 831.2142 866.8429 899.6560 913.3796 922.5402 936.5726 957.3723 978.1496 979.9022 1001.3029 1012.5421 1046.5728 1049.4970 1069.3017 1072.7078 1074.2009 1080.9365 1084.0802 1085.5363 1098.3359 1131.3534 1148.0447 1157.9040 1174.0378 1202.8756 1210.3995 1231.3752 1246.1838 1273.0052 1275.5316 1277.8643 1285.8405 1289.9023 1294.4280 1305.2133 1314.1289 1327.3978 1347.5707 1360.1872 1363.1569 1370.8723 1374.6059 1377.2051 1384.2681 1386.4801 1386.8852 1402.4975 1435.5180 1455.2623 1456.5477 1460.7067 1461.5514 1465.4131 1468.9589 1470.3984 1472.3206 1476.5704 1477.1654 1477.6367 1483.3774 1486.0413 1488.6970 1489.4417 1519.7381 1568.9569 1606.6206 2831.8163 2840.7703 2855.3010 2872.3716 2945.3313 2963.7958 2967.9025 2977.4894 2978.2134 2980.7413 2981.8555 2989.0221 3009.5759 3021.4114 3027.6544 3032.0250 3061.6799 3063.2693 3064.7659 3070.1406 3072.2312 3073.9631 3090.5371 3090.9699 3108.8652 3120.2908 3422.4760 3560.6366 3720.7499
redmass: 4.0009 3.5283 3.9586 4.0573 3.4061 2.8245 1.9284 3.1302 2.1783 1.4533 1.3844 2.5734 2.6486 1.4364 1.4788 2.5479 2.0407 2.1101 1.7603 1.9539 2.1467 2.7491 2.6090 2.5460 3.0875 3.2378 2.7105 2.4433 2.6179 2.4313 1.6931 2.0676 2.9931 2.5497 1.0436 4.7928 5.4763 2.6568 1.9327 2.5963 3.0217 1.3963 4.8081 1.1641 1.3894 3.4192 1.4424 1.7823 3.2003 1.8974 1.7278 1.5664 1.7458 1.6731 2.2329 1.6685 2.6010 1.6105 2.4642 2.0625 1.9377 2.5405 3.4899 1.8010 2.1649 2.8718 1.7474 2.0148 1.7305 3.4908 2.3062 1.7978 1.5260 1.3683 2.6782 1.4843 1.1208 1.5763 1.2105 1.2626 1.3382 1.8571 1.6440 1.5199 1.3373 1.3552 1.4256 1.3965 1.2628 1.2575 1.2367 1.2322 2.8497 1.1637 1.1851 1.0587 1.0734 1.0563 1.1559 1.1194 1.0631 1.0930 1.4669 1.0781 1.2611 1.0850 1.0682 1.1241 1.0767 4.7917 4.1776 1.6694 1.0714 1.0723 1.0713 1.0705 1.0648 1.0770 1.0392 1.0634 1.0431 1.0358 1.0358 1.0871 1.0952 1.0845 1.0869 1.0874 1.0991 1.0927 1.0992 1.0988 1.0985 1.0979 1.1001 1.1001 1.0922 1.0998 1.0742 1.0439 1.1058
irintensity: 0.0412 0.0567 0.0328 0.1127 0.5367 0.2340 0.3731 1.4223 1.1352 0.0971 0.0952 0.7163 0.1817 1.3375 0.1771 2.0760 3.4443 1.4841 2.4010 2.1580 1.5032 1.7878 4.4879 2.1321 1.9700 3.9528 3.4975 47.7451 17.8546 37.6022 123.4887 99.1278 3.0782 12.2306 0.2870 1.9690 2.3740 44.5197 54.8296 12.3729 3.7767 3.9293 2.4350 5.4307 14.8041 6.9646 0.9469 9.0613 3.1104 0.9759 6.2303 7.2006 5.6329 9.5397 11.4550 4.9193 1.9477 6.4662 9.8782 2.4291 19.2002 8.0672 37.5584 4.6328 27.5491 10.9168 11.9655 83.4697 6.4265 5.7308 25.5318 6.6402 18.9199 4.8730 0.9219 2.9951 3.6556 2.8316 21.8743 19.7516 16.9956 19.6866 11.0916 9.0032 4.8201 8.3761 8.9823 2.2520 11.2157 27.4920 15.1728 18.5120 49.5965 51.5060 17.8653 3.2730 7.9572 2.3641 9.8835 14.5068 2.7890 3.0577 59.2802 5.3462 111.1389 11.9210 12.1024 5.6779 15.6533 105.6779 129.8215 564.2788 41.6437 37.0558 259.6023 94.2481 16.0515 16.4333 42.9397 24.6425 25.0071 34.3456 29.3486 27.8706 31.5451 14.6024 19.7305 23.1483 3.8562 8.1837 89.6631 54.7238 52.0185 84.8269 27.6902 56.1808 25.1287 6.5758 0.5208 119.2962 46.0952
temp: 298.150 k
press: 1.00000 atm
elementType: 7 7 7 7 7 6 6 6 6 6 6 6 6 6 6 6 6 6 6 6 1 1 1 1 1 1 1 1 1 1 1 1 1 1 1 1 1 1 1 1 1 1 1 1 1 1 1 1 1
symmnumber: 1
zpe: 1126125.7 jmol-1
zpe.correction: 0.428919 hartree
zpe.thermalcorrener: 0.452894 hartree
zpe.thermalcorrenthalpy: 0.453839 hartree
zpe.thermalcorrgfe: 0.371708 hartree
zpe.sumelectzpe: -861.140505 hartree
zpe.sumelectthermal: -861.116529 hartree
zpe.sumelectthermalent: -861.115585 hartree
zpe.sumelectthermalfe: -861.197716 hartree
dipole: 1.2616 1.2537 -0.2761
dipole: 1.7999
quadrupole: -121.3410 -115.8303 -122.7862
quadrupole: 6.9990 0.6433 2.9031
quadrupole: -1.3551 4.1555 -2.8004 6.9990 0.6433 2.9031
hfenergy: -861.5694239 hartree
pointgroup: C01 [X(C15H29N5)]
dipole: -0.5013645 0.4963504 -0.0610473 debye
polarizability: 227.8115971|-10.6140729|213.6920939|33.1486482|-13.1610755|170.8725027 unknown
InChI: InChI=1S/C15H29N5/c1-5-20(6-2)9-7-8-12(3)17-10-14-11-18-15(16)19-13(14)4/h11-12,17H,5-10,16H2,1-4H3
charge 0 multiplicity 1
49 atoms
N  -4.269894 -0.697972 -0.039177
N  0.641961 1.609086 -0.107415
N  3.418706 -1.837511 0.314841
N  4.782387 -0.041011 1.283616
N  5.257092 -2.303311 1.691609
C  -1.743924 2.266459 -0.064023
C  -0.357923 2.537265 -0.700871
C  -2.328903 0.879176 -0.406658
C  -3.628338 0.580806 0.37017
C  0.023422 4.038898 -0.576795
C  -5.062382 -0.55497 -1.29047
C  -5.043174 -1.332529 1.062447
C  1.970622 1.549979 -0.767512
C  2.851474 0.490032 -0.135529
C  -5.222373 -1.880659 -2.059595
C  -4.142121 -2.037744 2.09477
C  2.617172 -0.913877 -0.291854
C  3.960374 0.851825 0.663881
C  1.490026 -1.443873 -1.145425
C  4.462192 -1.362904 1.078166
H  -2.445144 3.060281 -0.393141
H  -1.651984 2.373473 1.039401
H  -0.418298 2.281096 -1.780195
H  -2.521049 0.824528 -1.497514
H  -1.584026 0.09656 -0.177136
H  -4.338144 1.443047 0.263904
H  -3.381939 0.515863 1.446804
H  0.733224 1.747522 0.90993
H  0.036079 4.349708 0.486079
H  1.021302 4.244208 -1.005805
H  -0.707172 4.677631 -1.107841
H  -4.533444 0.164777 -1.942227
H  -6.07102 -0.110685 -1.085763
H  -5.715956 -2.086588 0.614714
H  -5.703235 -0.588963 1.579364
H  1.792429 1.316417 -1.836756
H  2.522509 2.52163 -0.74575
H  -4.229835 -2.295328 -2.307555
H  -5.768085 -2.63889 -1.46907
H  -5.786187 -1.718829 -2.997676
H  -3.541426 -2.820038 1.599248
H  -3.442678 -1.33335 2.580949
H  -4.753344 -2.506268 2.889179
H  4.208494 1.910094 0.818664
H  1.354095 -2.51988 -0.957869
H  0.55666 -0.894602 -0.932053
H  1.717657 -1.306072 -2.22099
H  6.04031 -1.994033 2.260369
H  5.049611 -3.28887 1.55706
