program: Gaussian 09
title: 000224601
version: EM64L-G09RevD.01
frameworkgroup: C1[X(C14H9ClO)]
method: RPBEPBE
basis: SDD
operation: Freq
keyword: #p
keyword: freq=noraman
keyword: PBEPBE/SDD
title: #p freq=noraman PBEPBE/SDD
converged: NO NO NO NO
title: Mulliken charges:
elementType: Cl O C C C C C C C C C C C C C C H H H H H H H H H
charge: -0.056957 -0.411210 0.267141 0.204140 0.280608 0.654986 0.160839 -0.783862 -0.384492 -0.378330 -0.400232 -0.460574 -0.253772 -0.267290 -0.237512 -0.243663 0.230399 0.231032 0.287748 0.268708 0.229864 0.230964 0.235482 0.232759 0.363224
chargesum: 0.00000
title: Mulliken charges with hydrogens summed into heavy atoms:
elementType: Cl O C C C C C C C C C C C C C C
charge: -0.056957 -0.047987 0.267141 0.204140 0.280608 0.654986 0.160839 -0.783862 -0.154093 -0.147298 -0.112484 -0.191866 -0.023908 -0.036326 -0.002030 -0.010904
polarizability: 2.54777262e+02 -1.34394313e+01 2.01029293e+02 3.00534910e-03 2.53991978e-03 6.05942095e+01
1716.lowfreq: -0.0013 -0.0008 -0.0004 6.4600 8.4512 14.7655 73.6867 97.9157 127.8187
frequency: 73.6739 97.9140 127.8175 158.8836 208.7797 236.9117 272.1382 309.7101 336.6007 349.3522 406.3605 429.3664 429.7598 437.8847 476.8003 539.5329 541.2890 573.0382 612.3718 618.2981 642.1662 654.4577 737.2882 739.1748 771.1319 779.7194 812.4422 822.3671 882.9496 910.7081 931.9400 957.3145 970.5685 990.3407 990.8201 999.1181 1040.0650 1045.8408 1058.9526 1106.7584 1150.4112 1178.7232 1180.1083 1212.3279 1248.5907 1273.8463 1294.7710 1319.8998 1383.1972 1390.4154 1410.1147 1435.9708 1445.7916 1452.3347 1497.5828 1529.1058 1576.1339 1602.4224 1619.1188 1621.8581 3131.0180 3133.3167 3145.1737 3150.2553 3159.0449 3165.8094 3171.9920 3180.3639 3492.7404
redmass: 6.8766 4.1262 5.0553 4.7156 11.8332 5.1322 4.4684 7.8604 5.5616 8.2633 6.6073 2.7320 7.5823 3.2590 1.2093 6.2794 3.6498 3.3231 6.9515 6.3676 4.0720 6.9031 2.5983 6.0841 1.4658 1.5368 5.8586 1.6203 1.4188 7.0747 3.3335 1.4091 1.3819 7.4368 1.3443 1.3350 3.3911 1.9196 3.1959 2.3138 1.4389 1.0794 1.1040 1.5145 1.5070 1.9854 2.3009 2.3186 4.3935 3.5143 3.5467 2.6451 2.6842 3.6408 3.4216 3.9171 7.4764 7.4518 6.5878 6.5978 1.0855 1.0855 1.0899 1.0902 1.0953 1.0952 1.0990 1.0972 1.0645
irintensity: 0.0001 0.5740 1.6135 1.5169 0.4580 1.2129 0.5044 7.9670 0.9544 6.8139 0.9770 18.6114 2.1235 1.6695 122.9250 2.3088 4.8037 0.9662 4.7232 9.0077 2.2667 25.3147 45.3947 24.9019 75.6051 67.7029 16.2686 0.0368 2.4051 26.6838 0.9334 0.9312 3.7872 3.1083 0.0917 0.2351 19.6054 24.5168 45.1229 10.6366 2.4755 2.1497 3.0220 161.4292 23.9169 10.9004 0.4193 28.0606 6.7457 5.9361 4.7791 3.4364 13.3838 20.9964 27.7688 8.1915 2.2879 75.4622 24.3033 1.6649 0.9196 3.1063 19.9951 3.5009 3.5788 32.6233 30.4787 11.0708 56.5968
temp: 298.150 k
press: 1.00000 atm
elementType: 17 8 6 6 6 6 6 6 6 6 6 6 6 6 6 6 1 1 1 1 1 1 1 1 1
symmnumber: 1
zpe: 488274.0 jmol-1
zpe.correction: 0.185974 hartree
zpe.thermalcorrener: 0.197991 hartree
zpe.thermalcorrenthalpy: 0.198936 hartree
zpe.thermalcorrgfe: 0.147803 hartree
zpe.sumelectzpe: -1073.115511 hartree
zpe.sumelectthermal: -1073.103493 hartree
zpe.sumelectthermalent: -1073.102549 hartree
zpe.sumelectthermalfe: -1073.153682 hartree
dipole: 0.2457 1.1878 0.0000
dipole: 1.2129
quadrupole: -87.6751 -86.2926 -105.5838
quadrupole: 1.1076 0.0003 0.0004
quadrupole: 5.5088 6.8912 -12.3999 1.1076 0.0003 0.0004
hfenergy: -1073.3014848 hartree
pointgroup: C01 [X(C14H9Cl1O1)]
dipole: 0.0308598 -0.4762076 0.0000142 debye
dipolederiv: -0.3012018 -0.2551697 0.0000111 -0.2835665 -0.6821843 0.0000226 0.0000119 0.0000234 -0.0442966 -0.4898904 0.4905646 -0.0000123 0.614171 -1.1668882 0.0000136 -0.0000159 0.0000171 -0.3789688 0.2360563 0.0369614 -0.0000021 0.0089292 -0.0174803 0.0000012 0.0000001 0.0000012 0.0256882 0.0560572 0.0201879 -0.0000032 0.0415616 -0.1046875 0.0000024 -0.0000059 0.0000032 -0.0234934 0.1024161 -0.0052036 -0.0000016 0.2947465 -0.1129905 -0.0000014 -0.0000117 0.0000028 0.0153027 0.0363864 -0.3687481 0.0000122 -0.2876968 -0.0202378 0.0000061 0.0000125 0.000006 0.1241216 0.4195262 -0.548714 0.0000116 -0.5820269 0.815197 -0.0000113 0.0000151 -0.000015 0.0892671 -0.0237123 0.7449232 -0.0000246 0.4155786 0.7468805 -0.0000348 -0.0000163 -0.0000384 -0.1858703 -0.1465695 -0.0702011 0.0000008 -0.0499651 0.0677785 -0.0000035 0.0000019 -0.0000033 -0.1506057 -0.0078855 0.023443 -0.0000002 -0.039612 0.0632103 -0.000003 0. -0.0000036 -0.1372108 -0.0921979 -0.0170015 -0.000001 -0.1605917 0.011156 -0.0000003 0.0000024 -0.0000032 -0.1432193 -0.0600581 0.1267068 -0.0000026 0.1111786 -0.0053361 -0.0000028 -0.0000028 -0.0000031 -0.1807644 -0.0232978 0.0706962 -0.0000035 0.0301201 0.097625 -0.0000052 -0.0000029 -0.0000064 -0.1528409 -0.1638837 -0.0590767 0.0000013 -0.0659618 0.0581033 -0.0000032 0.0000001 -0.0000037 -0.1696423 0.1004653 -0.0508193 -0.0000033 0.0080894 -0.0608372 -0.000002 -0.0000039 -0.0000007 -0.1653994 0.1205852 0.0160418 -0.0000005 0.0879619 0.0077434 -0.0000041 -0.0000017 -0.0000039 -0.1530566 0.0640066 0.1087264 -0.0000007 0.0479785 -0.0555363 0.0000032 -0.0000002 0.0000026 0.145673 0.0569807 -0.1100259 0.0000022 -0.0607932 -0.0526372 0.0000039 0.0000022 0.0000039 0.1437159 0.0821598 0.0362019 0.0000006 0.0789213 0.0161806 0.0000015 -0.0000004 0.0000024 0.1638105 0.0622584 -0.0382145 0.0000008 -0.0911984 -0.0103629 0.0000033 0.0000013 0.0000039 0.1656542 0.0115655 -0.094137 0.000004 -0.1190613 -0.0650257 0.000006 0.0000047 0.0000059 0.1591375 0.0245058 0.0870795 -0.0000008 0.109866 -0.0781093 0.0000036 -0.0000014 0.000004 0.1632904 -0.1412422 -0.0000731 0.0000048 0.0064096 0.0869371 0.0000014 0.0000044 0.0000013 0.1621761 -0.1393326 0.0151727 0.0000007 0.0031848 0.088316 0.0000013 0.0000013 0.0000013 0.1606079 0.2163023 -0.1593207 0.0000063 -0.1182234 0.3731856 0.0000016 0.0000051 0.0000023 0.3669233 unknown
polarizability: 257.8688124|2.2127085|197.9377426|-0.0022232|-0.0032467|60.5942095 unknown
InChI: InChI=1S/C14H9ClO/c15-13-11-7-3-1-5-9(11)10-6-2-4-8-12(10)14(13)16/h1-8,16H
charge 0 multiplicity 1
25 atoms
Cl 1.631624 3.241397 -0.000152
O  -1.376637 2.893143 -0.000099
C  -0.753966 -0.794461 -0.000017
C  0.712536 -0.838643 -0.000033
C  -1.431868 0.475393 -0.000032
C  1.46537 0.396429 -0.000064
C  -0.65425 1.698165 -0.000074
C  0.730841 1.634987 -0.00009
C  -1.563387 -1.971881 0.000017
C  1.445669 -2.063209 -0.000014
C  -2.857442 0.540078 -0.000011
C  2.893421 0.357031 -0.000067
C  -2.963507 -1.898774 0.000037
C  2.847181 -2.085501 -0.000022
C  -3.618116 -0.635009 0.000024
C  3.576845 -0.864417 -0.000046
H  -1.092485 -2.959006 0.000029
H  0.907985 -3.015553 0.000006
H  -3.334733 1.523129 -0.000023
H  3.448785 1.299426 -0.000085
H  -3.555968 -2.820224 0.000064
H  3.379333 -3.042686 -0.000008
H  -4.712054 -0.582762 0.00004
H  4.671955 -0.878838 -0.000049
H  -0.748634 3.664587 -0.00013
