program: Gaussian 09
title: 000224588
version: EM64L-G09RevD.01
frameworkgroup: C1[X(C10H9N3O)]
method: RPBEPBE
basis: SDD
operation: Freq
keyword: #p
keyword: freq=noraman
keyword: PBEPBE/SDD
title: #p freq=noraman PBEPBE/SDD
converged: YES YES NO NO
title: Mulliken charges:
elementType: O N N N C C C C C C C C C C H H H H H H H H H
charge: -0.227514 0.045925 -0.094570 -0.607779 0.193166 0.079470 0.142470 -0.345180 -0.327881 -0.189366 -0.781268 -0.242834 -0.208201 0.150047 0.245552 0.275926 0.257699 0.238246 0.238556 0.234749 0.239873 0.353550 0.329364
chargesum: 0.00000
title: Mulliken charges with hydrogens summed into heavy atoms:
elementType: O N N N C C C C C C C C C C
charge: -0.227514 0.045925 -0.094570 0.075136 0.193166 0.079470 0.142470 -0.099628 -0.051956 -0.189366 -0.046766 -0.008085 0.031672 0.150047
polarizability: 1.99997586e+02 9.09438450e+00 1.46891479e+02 -7.33909888e-04 3.37630792e-03 5.60506653e+01
1716.lowfreq: -0.0006 -0.0002 0.0006 4.4414 11.5553 12.1978 61.5932 74.9874 126.7937
frequency: 61.5755 74.9348 126.7572 137.9896 161.8732 205.6427 263.1827 271.7941 328.9671 376.0171 425.6062 481.7687 501.0440 518.5834 542.4916 551.3460 573.6203 586.2317 640.5524 658.4474 682.3114 725.0687 764.9453 779.3183 821.1618 853.1734 889.8481 894.2354 974.2511 974.5203 1005.6700 1019.4076 1040.6515 1062.1240 1071.9854 1115.9697 1174.3877 1188.2562 1267.8954 1275.0705 1299.3004 1349.2886 1373.1109 1389.7634 1414.6551 1445.8153 1453.9383 1465.5758 1491.1018 1524.7557 1544.0008 1558.1880 1618.9364 1646.3600 2986.5606 3064.6435 3123.1470 3134.9844 3147.4886 3163.0128 3177.9237 3485.3570 3666.2551
redmass: 5.9107 4.4777 1.0693 3.6870 5.6789 5.7363 3.0057 5.1242 5.5944 4.3182 3.2861 2.8509 5.9164 5.5520 4.3953 2.4360 6.0133 1.8121 5.0334 3.8898 1.0634 5.1763 2.9137 1.6245 4.4172 6.5674 1.6410 7.0521 1.3666 2.1885 1.3358 2.4179 1.6272 2.1163 2.4402 2.0401 1.1795 2.1828 1.9401 4.1273 4.9811 3.0087 3.1332 1.3065 6.7876 2.7999 1.2939 1.0466 3.0706 4.5096 1.4022 5.7494 6.3531 7.2685 1.0387 1.0969 1.0979 1.0859 1.0904 1.0965 1.0990 1.0463 1.1028
irintensity: 6.8579 1.0199 0.3868 1.9136 9.3616 0.0084 0.2739 0.5819 2.2916 8.7435 1.5181 13.8338 5.0282 0.7877 3.8858 58.0901 10.2120 96.5623 4.9519 71.4163 67.5641 8.6988 17.5440 81.0685 0.2777 1.0714 1.0766 0.9779 2.0323 10.2813 0.2928 4.9221 3.5649 8.6750 1.8484 6.7277 5.0826 44.1830 17.1128 5.1658 42.8338 92.1102 19.9122 14.6615 41.5182 1.9121 35.5584 19.0345 37.4603 95.2858 165.8363 37.8410 26.6617 234.0618 8.9585 12.2240 9.6929 0.3597 10.3560 20.0979 12.8126 43.2944 81.3706
temp: 298.150 k
press: 1.00000 atm
elementType: 8 7 7 7 6 6 6 6 6 6 6 6 6 6 1 1 1 1 1 1 1 1 1
symmnumber: 1
zpe: 458126.9 jmol-1
zpe.correction: 0.174491 hartree
zpe.thermalcorrener: 0.186092 hartree
zpe.thermalcorrenthalpy: 0.187037 hartree
zpe.thermalcorrgfe: 0.136678 hartree
zpe.sumelectzpe: -624.988001 hartree
zpe.sumelectthermal: -624.976400 hartree
zpe.sumelectthermalent: -624.975455 hartree
zpe.sumelectthermalfe: -625.025814 hartree
dipole: -4.6400 5.1140 -0.0108
dipole: 6.9052
quadrupole: -69.2241 -79.2685 -83.6726
quadrupole: 14.2596 -0.0461 0.0126
quadrupole: 8.1644 -1.8801 -6.2842 14.2596 -0.0461 0.0126
hfenergy: -625.162492 hartree
pointgroup: C01 [X(C10H9N3O1)]
dipole: -1.8095607 -2.0262663 0.0189354 debye
dipolederiv: -0.7812708 -0.2684837 0.0033896 -0.1412231 -0.8899542 0.0046929 0.0020512 0.0041462 -0.3445662 -0.4777752 -0.0217496 0.001229 0.1267872 -0.3397333 0.0000124 0.0015771 0.0002369 -0.1919549 -0.7521956 -0.196534 0.0030476 -0.1402578 -0.5716613 0.0016719 0.0028312 0.0025207 -0.1982328 -0.8880393 0.4384084 -0.0016649 0.2537997 -0.8237628 0.0006637 -0.0014988 0.0004028 -0.6719795 -0.0989842 0.0843276 0.0006881 0.2049114 -0.5168993 0.0010525 0.0004488 0.0015133 0.0797961 0.3291457 0.0588525 -0.0014319 -0.3330012 0.148609 0.0012437 -0.0006089 -0.0004517 0.0715601 0.3993198 0.0194546 -0.0016047 0.0009961 0.8421251 -0.0024469 -0.0018325 -0.0018912 0.0643083 -0.0863448 -0.0272578 -0.0001083 0.1178827 0.0823898 -0.0010244 -0.0006004 -0.0005046 -0.1464588 -0.2072571 0.0596364 0.000079 0.0675323 0.1196042 -0.0009778 0.0000016 -0.0009247 -0.1468771 0.2962086 0.1165467 -0.0013856 0.0636239 0.343321 -0.0008037 -0.0007637 -0.0012653 0.1035664 -0.0099448 -0.1437964 0.0002697 -0.0591848 -0.3002814 0.0009806 0.0000012 -0.0005539 0.0173115 0.1078654 0.1162166 -0.0014107 0.065925 -0.0934185 -0.0004215 -0.0012587 -0.0005676 -0.1472441 0.0560757 -0.1052961 -0.0005689 -0.1250493 0.139538 -0.0001266 -0.0004837 -0.0002955 -0.1310613 1.3851214 -0.1309549 -0.0033206 -0.0434029 1.330841 -0.008252 -0.0040002 -0.006976 0.1903124 0.0692745 -0.0263708 0.000413 -0.0805789 -0.0692918 0.0008948 0.0005767 0.0007548 0.1505826 0.0898481 -0.0584883 0.0004855 -0.0068282 -0.0131029 0.0004703 0.0003881 0.0007325 0.1613323 -0.0367358 0.1452432 -0.0009024 0.0408132 0.0577765 0.00047 -0.0002006 0.0006514 0.1192394 0.047566 -0.0444787 0.1067114 -0.0137966 0.0531485 0.0090587 0.0873415 0.0526491 -0.0236483 0.0483031 -0.0453973 -0.1058108 -0.0147256 0.0520916 -0.0100098 -0.0868974 -0.0526606 -0.0234377 -0.1098412 -0.0398662 0.0012547 -0.0479952 0.0783084 0.0004131 0.0013091 0.0003795 0.1593676 -0.0138736 0.1050552 0.0004714 0.1057083 -0.0089252 -0.000037 0.0004605 -0.0000494 0.1586046 0.4484413 0.0064669 -0.0005459 -0.0129088 0.1982114 0.0011191 0.0000229 0.0008659 0.3624259 0.1850927 -0.041534 0.0007158 -0.0290274 0.1810662 0.0013558 0.001135 0.0012873 0.3870536 unknown
polarizability: 200.135052|-8.6768631|146.7506548|-0.5729498|-0.2776675|56.0540241 unknown
InChI: InChI=1S/C10H9N3O/c1-6-7-4-2-3-5-8(7)13-10(12-6)9(11)14/h2-5H,11H2,1H3
charge 0 multiplicity 1
23 atoms
O  3.394522 1.754384 -0.026272
N  0.590007 1.194456 -0.00927
N  1.203369 -1.167392 -0.004816
N  3.786826 -0.551312 -0.012363
C  -1.15106 -0.570802 0.003511
C  -0.74925 0.819471 -0.002125
C  -0.088926 -1.55488 0.002513
C  -2.543536 -0.893893 0.01018
C  -1.745409 1.84417 -0.000239
C  1.48821 0.199967 -0.011201
C  -0.374779 -3.037963 0.009374
C  -3.500973 0.125848 0.011648
C  -3.099947 1.499823 0.006472
C  2.972468 0.564637 -0.017887
H  -2.860235 -1.942082 0.01435
H  -1.405529 2.883872 -0.00438
H  0.574906 -3.593095 0.012971
H  -0.96074 -3.330937 0.900411
H  -0.958086 -3.338944 -0.880807
H  -4.567398 -0.124213 0.016943
H  -3.864554 2.283959 0.007819
H  3.347364 -1.47445 -0.006175
H  4.797349 -0.428822 -0.015456
