program: Gaussian 09
title: 000224587
version: EM64L-G09RevD.01
frameworkgroup: C1[X(C10H6Cl3NO)]
method: RPBEPBE
basis: SDD
operation: Freq
keyword: #p
keyword: freq=noraman
keyword: PBEPBE/SDD
title: #p freq=noraman PBEPBE/SDD
converged: YES YES NO NO
title: Mulliken charges:
elementType: Cl Cl Cl O N C C C C C C C C C C H H H H H H
charge: 0.003795 0.054421 0.046178 -0.259890 0.021142 0.685435 0.003734 -0.643742 0.592925 -0.300134 -0.323660 -0.314030 -0.171791 -0.357643 -0.513706 0.275637 0.237833 0.252007 0.245863 0.233851 0.231776
chargesum: 0.00000
title: Mulliken charges with hydrogens summed into heavy atoms:
elementType: Cl Cl Cl O N C C C C C C C C C C
charge: 0.003795 0.054421 0.046178 -0.259890 0.021142 0.685435 0.003734 -0.643742 0.592925 -0.300134 -0.323660 -0.038393 0.066042 -0.105636 0.197784
polarizability: 2.20188570e+02 -4.09173094e+00 1.82286920e+02 2.70390536e+00 1.16617976e+00 6.02742913e+01
1716.lowfreq: -6.8610 -3.0010 -0.0027 -0.0004 0.0015 3.2121 51.1159 65.7297 74.4664
frequency: 51.1026 65.7272 74.4662 116.7643 129.5088 141.0868 193.3635 199.4786 213.6012 221.1836 283.0534 310.5168 315.7140 344.7298 365.8771 429.3373 455.5481 474.3865 567.9866 611.1960 618.1425 637.2767 687.0099 739.1592 782.2598 810.5624 867.4744 882.2761 899.6650 947.7811 949.1162 993.4791 1034.1478 1050.7983 1105.5740 1131.0450 1150.8731 1208.7258 1254.7273 1319.7828 1328.8326 1348.1397 1394.5675 1413.9076 1441.8355 1454.8447 1463.2504 1465.0028 1524.7335 1573.1970 1594.6382 2980.9252 3079.6903 3133.4396 3137.9833 3158.1510 3179.1626
redmass: 3.8136 5.7955 6.0339 5.2608 7.2041 1.0594 17.9649 17.0832 9.5614 4.9873 11.1220 9.7747 14.3482 13.4511 6.4570 6.8447 7.0793 5.8767 4.5734 7.8861 5.5741 9.8319 10.4822 8.0232 8.8022 1.4182 5.3063 9.4175 8.5189 1.9119 3.7279 1.3683 3.8205 3.4114 1.2309 1.7413 1.3710 1.9195 6.2333 5.5182 2.7842 3.2627 5.0325 2.0426 1.5101 3.3758 1.0788 1.0616 7.5819 8.3651 7.0526 1.0304 1.1057 1.0900 1.1021 1.0896 1.0998
irintensity: 4.3085 1.3853 1.6729 3.7225 1.5437 0.2615 0.8227 0.1680 1.2495 6.8955 0.7137 0.3480 0.8372 2.8653 0.3647 2.1355 1.7193 4.5047 1.0050 14.9160 6.0334 3.6753 62.1586 3.3652 24.4073 52.8564 6.3603 12.0390 22.9588 28.6640 74.8620 0.8501 5.8136 26.4894 0.3048 14.4453 8.0160 24.7954 100.1774 95.5328 55.8608 34.1369 49.0790 15.2869 34.8395 9.2888 9.4320 16.7543 1.4389 38.6221 5.5249 57.0822 23.6944 15.3233 18.8486 5.3709 15.9601
temp: 298.150 k
press: 1.00000 atm
elementType: 17 17 17 8 7 6 6 6 6 6 6 6 6 6 6 1 1 1 1 1 1
symmnumber: 1
zpe: 354733.5 jmol-1
zpe.correction: 0.135111 hartree
zpe.thermalcorrener: 0.148888 hartree
zpe.thermalcorrenthalpy: 0.149832 hartree
zpe.thermalcorrgfe: 0.093307 hartree
zpe.sumelectzpe: -1893.729310 hartree
zpe.sumelectthermal: -1893.715533 hartree
zpe.sumelectthermalent: -1893.714589 hartree
zpe.sumelectthermalfe: -1893.771113 hartree
dipole: 0.9715 -2.9469 1.8233
dipole: 3.5990
quadrupole: -89.7557 -110.3985 -107.9977
quadrupole: -4.6995 -5.5485 -2.8539
quadrupole: 12.9616 -7.6812 -5.2804 -4.6995 -5.5485 -2.8539
hfenergy: -1893.8644206 hartree
pointgroup: C01 [X(C10H6Cl3N1O1)]
dipole: 0.2969101 -1.1904726 0.7067928 debye
dipolederiv: -0.1375611 -0.1229252 -0.0040555 -0.2247039 -0.7508061 -0.0501948 -0.0012859 -0.0227382 -0.0275727 -0.0131573 -0.1277034 0.0003439 -0.0971858 -0.7151793 -0.0141385 -0.004007 -0.0305499 0.0013119 -0.5154868 0.3106209 -0.0216646 0.3777648 -0.2748365 0.0275347 -0.0027732 0.0159897 -0.0047489 -1.4381125 -0.2330229 0.2678706 -0.3446967 -0.4025814 0.0910381 0.1368406 0.0689273 -0.3803708 -0.3826309 -0.0069095 -0.0043549 0.0545166 -0.3304691 -0.0022425 -0.0088049 -0.0044644 -0.2128725 -0.0194815 -0.0637775 -0.0095239 0.1016248 -0.407982 -0.0229402 0.0013639 -0.0188651 0.1393637 0.2466099 -0.018213 0.0109227 -0.2775907 -0.0959018 -0.0128612 0.0130134 -0.0077791 0.0468335 -0.0337057 0.1640058 0.0430663 0.4046549 1.0346209 0.0874593 0.0418205 0.047664 -0.1439801 1.016614 0.3285156 -0.1025683 0.4602517 0.0312777 -0.0500594 0.1349732 0.0139826 0.0594437 -0.166205 0.2094861 -0.002892 0.2925484 1.0457758 0.0450958 0.0001345 0.0465922 -0.0361578 0.5671433 -0.5139269 0.0595622 -0.7840607 0.1843254 -0.0342016 0.0251101 -0.0150219 -0.0845182 0.1529913 0.0371755 0.020915 -0.0680473 0.1034206 0.0061379 0.0121092 0.0134058 -0.1246459 -0.1597297 -0.1466119 -0.0077912 -0.2843399 -0.0613677 -0.0104118 -0.0172448 -0.0059651 -0.1019916 0.3108603 0.0982684 0.0227509 0.2579254 0.257974 0.0236133 0.0268841 0.0157964 -0.0470852 0.6286565 0.0804649 -0.1997787 0.0752431 0.2865216 -0.061073 -0.463338 -0.1306481 0.4629841 0.109357 -0.0460073 -0.0051679 0.0096912 -0.0092878 -0.0041595 -0.0007911 -0.0087426 0.1508643 -0.037725 0.0884402 -0.0048642 0.1053765 0.030667 -0.0000871 -0.0058531 -0.0004412 0.1610356 -0.1108046 -0.0401394 -0.0124083 -0.0585631 0.0670428 -0.0047391 -0.0139823 -0.0039858 0.1296718 -0.1150452 -0.0708415 -0.0159253 -0.0801973 0.0929433 -0.0066369 -0.0413466 -0.018048 0.0630474 0.0699136 -0.0182469 0.0230829 0.0598007 -0.0616853 -0.1211292 0.0953227 -0.0434371 -0.0151043 0.0274994 0.091348 -0.0575197 0.0199872 -0.024472 0.1139958 0.0718546 0.0883285 -0.0355081 unknown
polarizability: 219.3417817|-7.0425273|183.1597717|0.9205818|1.772985|60.2482277 unknown
InChI: InChI=1S/C10H6Cl3NO/c1-15-10-6(11)5-3-2-4-14-9(5)7(12)8(10)13/h2-4H,1H3
charge 0 multiplicity 1
21 atoms
Cl -0.855307 -3.033784 -0.194677
Cl 0.36373 3.29331 0.06627
Cl -2.684044 2.177857 -0.141011
O  -2.868514 -0.8058 -0.330609
N  2.425649 1.119406 0.101668
C  0.871293 -0.813551 -0.039607
C  1.141469 0.614466 0.021569
C  -0.484591 -1.254791 -0.118323
C  -1.56006 -0.360645 -0.148759
C  0.029909 1.529506 -0.003874
C  -1.278626 1.050539 -0.085572
C  1.998086 -1.697848 -0.017736
C  3.286612 -1.170519 0.061485
C  3.451886 0.24887 0.120107
C  -3.657918 -1.009357 0.909921
H  1.828888 -2.777265 -0.064649
H  4.165467 -1.82147 0.078939
H  4.45361 0.689271 0.184109
H  -4.644832 -1.349957 0.565932
H  -3.756773 -0.06032 1.467369
H  -3.186033 -1.784017 1.541446
