program: Gaussian 09
title: 000224586
version: EM64L-G09RevD.01
frameworkgroup: C1[X(C10H5Cl4NO)]
method: RPBEPBE
basis: SDD
operation: Freq
keyword: #p
keyword: freq=noraman
keyword: PBEPBE/SDD
title: #p freq=noraman PBEPBE/SDD
converged: YES YES NO NO
title: Mulliken charges:
elementType: Cl Cl Cl Cl O N C C C C C C C C C C H H H H H
charge: 0.013935 0.061843 0.053402 -0.027192 -0.259359 0.027000 0.706368 0.026430 -0.657460 0.603831 -0.304150 -0.336762 -0.237540 -0.065367 -0.381287 -0.513318 0.298357 0.275751 0.247828 0.232934 0.234758
chargesum: 0.00000
title: Mulliken charges with hydrogens summed into heavy atoms:
elementType: Cl Cl Cl Cl O N C C C C C C C C C C
charge: 0.013935 0.061843 0.053402 -0.027192 -0.259359 0.027000 0.706368 0.026430 -0.657460 0.603831 -0.304150 -0.336762 0.060816 -0.065367 -0.105535 0.202201
polarizability: 2.61151804e+02 -2.29263202e+00 1.85961635e+02 1.01780492e+00 -1.89367607e+00 6.27256626e+01
1716.lowfreq: -0.0012 0.0042 0.0042 2.0732 5.8251 6.2163 44.2025 58.5806 71.3141
frequency: 44.1980 58.5755 71.3088 83.2499 128.1262 132.6266 143.4134 180.6078 193.1604 199.4480 249.5721 260.2008 278.5542 317.6572 321.6846 356.5601 359.4179 408.7242 442.2877 467.5716 514.7198 594.0169 617.5892 620.6624 662.4757 714.7655 737.9982 783.2054 851.0670 898.0759 900.6484 909.8800 923.7128 952.5534 1051.0990 1088.6534 1107.4983 1150.9831 1184.6815 1245.4382 1297.5319 1318.4287 1349.3825 1393.2370 1400.6755 1434.7014 1442.9864 1462.3781 1465.4298 1511.4442 1568.9252 1587.1442 2982.4454 3082.1699 3139.9902 3150.3015 3178.3402
redmass: 6.2921 4.3822 5.4000 11.1720 6.9019 7.8748 1.1666 5.5632 17.1044 31.2885 6.6441 12.0396 14.5833 20.8919 10.6645 11.7607 7.4717 8.8638 7.3952 5.3326 8.5491 4.5353 8.4462 9.6055 10.7029 11.5997 8.2323 9.0095 5.0833 6.4566 1.6349 8.8643 1.5457 9.1431 8.6824 2.1963 1.2299 1.3676 4.6333 3.9419 2.0649 4.9948 4.9073 4.8892 3.2243 5.2662 1.3923 1.0569 1.0534 9.9206 9.0795 8.3159 1.0304 1.1059 1.1022 1.0929 1.0931
irintensity: 2.1965 2.8066 1.5421 0.5201 0.4908 0.1098 0.3371 3.9417 0.9522 0.1077 5.3307 1.3047 1.2284 0.3345 2.3038 0.1834 2.3577 1.9969 5.3926 2.7171 25.3120 8.6486 1.5952 18.3902 19.7380 33.1757 9.2962 25.3605 5.3390 42.8502 27.5538 69.7285 7.4746 97.5953 15.8649 50.8111 0.0478 8.5009 46.0927 133.9083 33.6949 87.7621 68.4390 57.8495 7.6734 35.0389 36.1490 11.5455 15.0329 4.4055 37.0093 16.4910 56.3753 22.8849 17.8657 3.9904 2.1805
temp: 298.150 k
press: 1.00000 atm
elementType: 17 17 17 17 8 7 6 6 6 6 6 6 6 6 6 6 1 1 1 1 1
symmnumber: 1
zpe: 328806.7 jmol-1
zpe.correction: 0.125236 hartree
zpe.thermalcorrener: 0.140378 hartree
zpe.thermalcorrenthalpy: 0.141322 hartree
zpe.thermalcorrgfe: 0.081196 hartree
zpe.sumelectzpe: -2353.116633 hartree
zpe.sumelectthermal: -2353.101490 hartree
zpe.sumelectthermalent: -2353.100546 hartree
zpe.sumelectthermalfe: -2353.160673 hartree
dipole: -0.3196 2.1531 1.7698
dipole: 2.8053
quadrupole: -114.8000 -121.0358 -119.3723
quadrupole: -5.2498 -5.9603 4.3057
quadrupole: 3.6027 -2.6331 -0.9696 -5.2498 -5.9603 4.3057
hfenergy: -2353.2418686 hartree
pointgroup: C01 [X(C10H5Cl4N1O1)]
dipole: -0.2749511 -0.8118287 -0.6953469 debye
dipolederiv: -0.0881107 0.0167811 -0.0066901 -0.1038339 -0.7523194 0.0518986 -0.0022745 0.0251272 -0.0209931 0.0002527 0.0180015 -0.0028635 0.0674765 -0.723363 0.0156108 -0.0028382 0.0327174 0.0069975 -0.6648031 0.2430722 0.0199859 0.3141213 -0.1467423 -0.0191917 -0.0014454 -0.0119346 0.0001174 -0.895922 0.2430871 0.0086563 0.4089642 -0.2177496 -0.0017486 0.0096111 -0.0001471 -0.0455293 -1.3395738 -0.4082285 -0.2526846 -0.5583796 -0.5585284 -0.1485139 -0.1300821 -0.0967158 -0.3846551 -0.2333692 -0.0149135 0.0004311 0.1461007 -0.3298053 0.0023422 -0.0045852 0.0066727 -0.2019416 0.104836 -0.0140655 0.0026182 0.1203779 -0.3305608 0.0271561 -0.0085992 0.0185976 0.1331802 0.2240075 0.0422893 -0.0108476 -0.230741 -0.171462 0.0100445 -0.0095022 0.0083258 0.0431684 -0.1869982 -0.0587377 -0.0242297 0.2163214 1.0589695 -0.0992878 -0.0343457 -0.0612306 -0.1445718 0.8891772 0.4767532 0.0956316 0.6371802 0.2564455 0.0741036 -0.1343009 -0.0382432 0.0654009 -0.1748844 -0.0261187 0.0096643 -0.0101934 1.1126037 -0.0442071 0.0083305 -0.0499351 -0.0315424 0.8144149 -0.4078142 -0.0549058 -0.6829895 -0.0855422 0.0148198 -0.0180788 0.0072895 -0.0865335 -0.21735 0.1098172 -0.0105247 0.0087727 -0.00502 -0.0052989 0.0039281 -0.0109074 -0.0847717 1.1862619 -0.4660032 -0.0075183 -0.7769717 0.171109 0.0099458 0.0002758 0.007891 -0.0244653 -0.0964513 0.1647606 -0.0100119 0.306659 0.2636264 -0.0227846 -0.0109956 -0.0186143 0.0018134 0.6011169 0.1400155 0.1859583 0.1527567 0.3325891 0.1032231 0.4542467 0.2205738 0.468719 0.1223259 -0.0102484 0.0036593 0.0304612 0.0428855 0.0036316 -0.0020691 0.0066953 0.1603142 -0.0326118 -0.047966 0.0077023 -0.0405051 0.0725588 0.0040819 0.0078915 0.004328 0.1286412 -0.0745819 -0.1027297 0.0134328 -0.1142589 0.0571856 0.0087188 0.0353534 0.025205 0.0638017 0.0039356 0.097398 0.0787396 0.0259633 0.0008432 -0.0983117 -0.0562318 -0.0982649 -0.0313601 0.0583279 0.0048497 -0.0462036 0.082718 -0.0477233 0.1137674 -0.1042882 0.0225698 -0.0157899 unknown
polarizability: 259.4068793|-11.5623605|187.6992014|0.3330665|-2.2704505|62.7330205 unknown
InChI: InChI=1S/C10H5Cl4NO/c1-16-10-6(12)5-2-4(11)3-15-9(5)7(13)8(10)14/h2-3H,1H3
charge 0 multiplicity 1
21 atoms
Cl -0.53228 -3.062124 0.217254
Cl -0.619832 3.378343 -0.070383
Cl -3.380966 1.670549 0.114103
Cl 4.76983 -1.150547 -0.046604
O  -2.959748 -1.285669 0.32034
N  1.838383 1.663267 -0.083966
C  0.7039 -0.539866 0.058043
C  0.679683 0.912462 -0.008875
C  -0.533878 -1.248486 0.130628
C  -1.76743 -0.587474 0.146695
C  -0.591955 1.58525 0.004261
C  -1.777412 0.851294 0.077624
C  1.983182 -1.183273 0.047128
C  3.123226 -0.392408 -0.02857
C  3.022992 1.031369 -0.093688
C  -3.680537 -1.654967 -0.924383
H  2.045202 -2.272968 0.098057
H  3.923862 1.651065 -0.154431
H  -4.579863 -2.187216 -0.583922
H  -3.054058 -2.321289 -1.544631
H  -3.965902 -0.749612 -1.48988
