program: Gaussian 09
title: 000224585
version: EM64L-G09RevD.01
frameworkgroup: C1[X(C9H4Cl3NO)]
method: RPBEPBE
basis: SDD
operation: Freq
keyword: #p
keyword: freq=noraman
keyword: PBEPBE/SDD
title: #p freq=noraman PBEPBE/SDD
converged: NO NO NO NO
title: Mulliken charges:
elementType: Cl Cl Cl O N C C C C C C C C C H H H H
charge: 0.016946 0.056408 0.012047 -0.381102 0.018218 0.697073 -0.002145 -0.642835 -0.308134 0.554218 -0.308072 -0.312813 -0.169936 -0.360344 0.275383 0.237424 0.251635 0.366027
chargesum: 0.00000
title: Mulliken charges with hydrogens summed into heavy atoms:
elementType: Cl Cl Cl O N C C C C C C C C C
charge: 0.016946 0.056408 0.012047 -0.015075 0.018218 0.697073 -0.002145 -0.642835 -0.308134 0.554218 -0.308072 -0.037429 0.067488 -0.108708
polarizability: 1.98778932e+02 -1.33259873e+01 1.79504534e+02 1.51691566e-03 -1.20795511e-02 4.89340996e+01
1716.lowfreq: -9.4247 -5.1386 -0.0040 -0.0034 -0.0034 5.8381 65.6074 94.4919 122.4736
frequency: 65.6043 94.4910 122.4735 148.7378 194.0209 199.8616 215.9364 298.6896 302.2708 325.8855 332.6835 343.8467 434.2883 434.9651 449.2544 468.8169 550.5818 608.2146 611.5820 637.9831 681.5973 708.9758 802.7682 807.8578 861.2011 891.0192 927.7717 944.4550 993.3164 1024.1171 1042.5310 1131.8642 1190.4751 1221.9429 1270.6268 1336.9229 1342.4836 1366.7360 1406.7809 1430.6877 1478.5965 1534.5979 1589.5870 1603.3106 3134.0740 3158.2258 3178.9939 3484.9030
redmass: 16.0976 9.1360 6.2368 7.0191 22.8236 21.5964 9.6773 13.1492 7.9074 10.0892 6.7649 14.3878 1.2066 9.0726 3.7341 9.7942 4.3875 5.3552 8.6596 7.5901 8.3212 8.0067 10.1070 1.4535 4.6235 10.1634 8.1588 1.4758 1.3640 6.8917 2.4708 1.7716 1.6343 1.5392 6.0713 9.1719 2.4120 2.2480 4.8955 3.8355 3.8421 8.4184 6.0943 9.0524 1.0898 1.0897 1.0998 1.0648
irintensity: 0.6265 0.5527 0.8015 3.2435 0.3627 0.1157 1.2878 5.4489 2.4354 7.3691 0.3401 5.4179 129.6743 0.9929 9.4954 4.0475 1.3102 1.7725 26.4857 4.3570 30.2003 2.9049 51.2649 53.3057 12.0072 14.9820 74.0684 0.3544 0.9301 3.5633 10.0666 21.0637 233.7120 58.5254 73.5088 54.4113 41.1326 0.5998 47.1286 55.8699 25.9883 6.5664 14.2671 23.9047 13.7228 6.2302 15.4472 100.4042
temp: 298.150 k
press: 1.00000 atm
elementType: 17 17 17 8 7 6 6 6 6 6 6 6 6 6 1 1 1 1
symmnumber: 1
zpe: 283434.8 jmol-1
zpe.correction: 0.107955 hartree
zpe.thermalcorrener: 0.119846 hartree
zpe.thermalcorrenthalpy: 0.120790 hartree
zpe.thermalcorrgfe: 0.069067 hartree
zpe.sumelectzpe: -1854.526354 hartree
zpe.sumelectthermal: -1854.514463 hartree
zpe.sumelectthermalent: -1854.513518 hartree
zpe.sumelectthermalfe: -1854.565241 hartree
dipole: 1.4402 0.4569 0.0000
dipole: 1.5109
quadrupole: -84.4711 -105.9418 -102.4231
quadrupole: -10.8915 0.0011 0.0004
quadrupole: 13.1409 -8.3298 -4.8111 -10.8915 0.0011 0.0004
hfenergy: -1854.6343088 hartree
pointgroup: C01 [X(C9H4Cl3N1O1)]
dipole: 0.350574 -0.4800723 0.000002 debye
dipolederiv: -0.0690638 0.0305845 0.0000011 -0.1034539 -0.7734513 0.000063 0.0000123 0.000056 -0.0120366 0.0027672 0.0367618 -0.0000022 0.0797752 -0.6950515 0.0000397 -0.0000059 0.0000413 0.0052794 -0.6582497 0.2133381 0.0000148 0.2360748 -0.1974756 0.000005 0.0000131 0.0000064 -0.0017986 -1.3128439 -0.3493725 0.0000864 -0.5937448 -0.3038709 0.0000258 0.0001087 0.0000161 -0.3716454 -0.270456 -0.0700156 0.0000086 0.0711277 -0.3294319 0.0000047 0.0000006 0.0000108 -0.2114285 0.1022006 0.0974044 -0.0000056 0.1880501 -0.3393862 0.0000243 -0.000013 0.0000302 0.1421346 0.131077 0.1466232 -0.000016 -0.2086372 -0.1984492 0.0000262 0.0000081 0.0000076 0.035177 -0.2410433 -0.1846505 0.0000206 0.2505142 1.1516816 -0.0001141 -0.0000167 -0.0000888 -0.1705826 -0.0137286 -0.1885733 0.0000106 0.0497731 1.0485961 -0.0000645 -0.0000071 -0.0000516 -0.0161625 0.9931292 0.51733 -0.000097 0.6487245 -0.0517168 -0.0000197 -0.0001055 -0.0000173 0.1747263 0.7207948 -0.3168808 -0.0000089 -0.7335431 0.0100271 0.0000237 0.0000238 0.0000019 -0.1064378 0.0962149 -0.0009876 -0.0000133 -0.0367878 0.0993427 -0.0000141 -0.0000114 -0.0000156 -0.1325728 -0.0440003 -0.1276627 0.0000054 -0.281418 -0.0830742 0.0000156 0.0000171 0.0000068 -0.0961004 0.1816018 0.1288529 -0.0000243 0.2689064 0.2733848 -0.0000402 -0.0000318 -0.0000317 -0.0563078 0.1101469 -0.0231779 0.000004 0.0335333 -0.0111555 0.0000094 0.0000004 0.0000128 0.1523628 -0.0708432 0.0704446 0.0000089 0.0854017 0.0653011 0.0000019 0.0000087 0.0000027 0.1606593 -0.0839212 -0.0701931 0.000018 -0.0875695 0.0396165 0.0000121 0.0000168 0.0000107 0.1326884 0.4262177 0.0901745 -0.0000112 0.1332732 0.2951131 0.0000013 -0.0000182 0.0000016 0.3720453 unknown
polarizability: 204.746875|-5.1900954|173.5365909|-0.0083678|-0.0088429|48.9340996 unknown
InChI: InChI=1S/C9H4Cl3NO/c10-5-4-2-1-3-13-8(4)6(11)7(12)9(5)14/h1-3,14H
charge 0 multiplicity 1
18 atoms
Cl -0.513709 -3.252338 0.000301
Cl -0.552376 3.198299 -0.000153
Cl -3.333799 1.483273 0.000076
O  -2.895711 -1.496395 0.000317
N  1.908548 1.468243 -0.00019
C  0.749976 -0.733177 0.000037
C  0.745267 0.721431 -0.000066
C  -0.489274 -1.441296 0.000164
C  -0.52183 1.402713 -0.000044
C  -1.715326 -0.767086 0.000185
C  -1.706592 0.669419 0.000068
C  2.028846 -1.381941 0.000008
C  3.1925 -0.614025 -0.000115
C  3.083799 0.812836 -0.000216
H  2.06872 -2.474747 0.000082
H  4.180462 -1.083616 -0.00014
H  3.983525 1.438713 -0.000314
H  -3.680029 -0.883705 0.000301
