program: Gaussian 09
title: 000224570
version: EM64L-G09RevD.01
frameworkgroup: C1[X(C15H11ClO2)]
method: RPBEPBE
basis: SDD
operation: Freq
keyword: #p
keyword: freq=noraman
keyword: PBEPBE/SDD
title: #p freq=noraman PBEPBE/SDD
converged: YES YES NO NO
title: Mulliken charges:
elementType: Cl O O C C C C C C C C C C C C C C C H H H H H H H H H H H
charge: -0.061191 -0.421549 -0.238037 0.304125 0.570955 0.094571 -0.276079 -0.343554 -0.339013 -0.301848 -0.328273 -0.377075 -0.400399 -0.352878 0.290229 -0.230998 -0.243035 -0.224546 0.276462 0.267692 0.276132 0.238801 0.240697 0.225869 0.257392 0.259206 0.237111 0.240127 0.359107
chargesum: 0.00000
title: Mulliken charges with hydrogens summed into heavy atoms:
elementType: Cl O O C C C C C C C C C C C C C C C
charge: -0.061191 -0.062442 -0.238037 0.304125 0.570955 0.094571 0.000382 -0.075862 -0.062881 -0.063047 -0.328273 -0.136378 -0.174530 -0.095486 0.290229 0.028208 -0.005924 0.015581
polarizability: 3.03480528e+02 -8.67447713e+00 2.04248975e+02 -1.40244836e+01 -6.29623915e+00 8.39169527e+01
1716.lowfreq: -5.0250 -0.0021 -0.0013 0.0010 0.6143 4.4853 15.7059 33.8655 49.9478
frequency: 15.6374 33.8426 49.9440 88.6013 98.9862 129.1559 146.4266 173.8535 198.8173 238.4008 273.5824 304.0110 345.2983 376.8050 386.1630 389.0974 414.6636 418.2992 447.0887 495.3902 514.0984 539.4504 564.1387 613.0475 632.9757 659.5523 671.0502 708.1748 723.4466 750.9268 767.8693 811.4998 813.2658 841.5327 852.9183 867.7653 895.3781 949.2208 953.5508 982.3201 988.5238 1000.5866 1008.1600 1015.9803 1042.0904 1073.1096 1107.0457 1122.1506 1143.7367 1173.3549 1181.4567 1217.3814 1255.2699 1267.4911 1285.0786 1297.0362 1307.9521 1317.8237 1375.9875 1391.9642 1427.2406 1429.0993 1459.1970 1498.4072 1522.4892 1565.1884 1587.9608 1601.0932 1617.8362 1626.3849 3118.1292 3123.3828 3137.7146 3139.7634 3151.8264 3154.5971 3161.9309 3165.5959 3176.9224 3178.7060 3577.1725
redmass: 7.8817 7.5528 4.2147 5.3969 7.2367 5.6353 3.8754 4.9715 5.3260 8.0573 4.2273 4.3533 9.0985 7.8767 1.2532 3.2127 3.5227 4.6455 3.1354 3.5106 3.6968 4.3986 5.9908 6.3319 6.7009 4.0747 5.6017 4.6762 3.5696 2.3344 1.6615 1.4176 5.1149 3.3439 1.7766 1.4022 2.3040 1.3276 1.3799 1.3729 1.3393 2.9938 1.3054 4.0162 2.0487 3.6407 1.4609 1.7659 1.3387 1.0780 1.1144 1.6609 2.5738 1.8168 1.8163 2.8213 1.3247 1.3193 5.2616 4.8965 2.5502 3.3046 2.4997 2.7615 8.8493 5.7309 6.6775 6.7595 6.1838 5.8163 1.0898 1.0927 1.0864 1.0856 1.0902 1.0886 1.0940 1.0955 1.0971 1.0998 1.0660
irintensity: 2.7612 0.9094 0.5075 0.4323 0.8704 6.0459 5.9447 1.6274 1.4678 1.4841 1.4810 3.7290 0.0544 18.7256 128.8694 23.9310 4.0271 2.2221 9.7700 9.3031 2.0903 10.0076 51.4868 3.8486 1.9888 14.4987 14.8634 7.5101 2.6588 13.8632 92.1357 21.5301 23.8999 9.6184 40.1855 0.7623 13.7529 4.3523 1.1414 3.5619 1.8903 5.6601 44.1210 45.3222 1.5992 35.1830 55.1929 1.8802 315.5857 5.5856 39.9561 23.6239 21.6864 63.3991 6.3931 348.0617 5.2867 15.8175 15.6287 3.3851 20.8958 26.1034 54.9250 39.3238 177.2663 5.6379 37.7476 9.4412 193.2402 53.4501 15.8354 6.7290 17.3437 0.3217 4.7848 0.2993 5.1963 13.7768 7.3818 15.2726 61.6419
temp: 298.150 k
press: 1.00000 atm
elementType: 17 8 8 6 6 6 6 6 6 6 6 6 6 6 6 6 6 6 1 1 1 1 1 1 1 1 1 1 1
symmnumber: 1
zpe: 563016.8 jmol-1
zpe.correction: 0.214442 hartree
zpe.thermalcorrener: 0.230191 hartree
zpe.thermalcorrenthalpy: 0.231135 hartree
zpe.thermalcorrgfe: 0.169043 hartree
zpe.sumelectzpe: -1187.438657 hartree
zpe.sumelectthermal: -1187.422908 hartree
zpe.sumelectthermalent: -1187.421964 hartree
zpe.sumelectthermalfe: -1187.484056 hartree
dipole: -3.0664 -3.4223 1.4994
dipole: 4.8335
quadrupole: -93.5160 -113.6177 -113.0483
quadrupole: -14.0929 1.2257 -3.8234
quadrupole: 13.2114 -6.8904 -6.3210 -14.0929 1.2257 -3.8234
hfenergy: -1187.6530991 hartree
pointgroup: C01 [X(C15H11Cl1O2)]
dipole: -1.1184718 1.4688078 0.4560133 debye
polarizability: 301.485382|-14.3288202|156.3852566|23.6051677|57.9331035|133.7758175 unknown
InChI: InChI=1S/C15H11ClO2/c16-14-4-2-1-3-11(14)7-10-15(18)12-5-8-13(17)9-6-12/h1-10,17H
charge 0 multiplicity 1
29 atoms
Cl -1.743722 1.852116 1.884866
O  5.364457 1.319467 1.359914
O  1.374413 -2.367457 -2.048467
C  2.143709 -0.575876 -0.63106
C  -2.389822 0.114466 -0.254822
C  1.080553 -1.319189 -1.379764
C  -0.956853 -0.211713 -0.336149
C  2.06621 0.812487 -0.336927
C  3.323255 -1.285583 -0.263615
C  -0.342905 -0.882062 -1.361131
C  -2.89114 1.02791 0.715911
C  -3.358356 -0.46941 -1.127567
C  3.125956 1.470768 0.31788
C  4.378295 -0.646043 0.402918
C  4.277156 0.736875 0.696845
C  -4.253484 1.360589 0.824748
C  -4.72546 -0.152176 -1.038369
C  -5.179005 0.765683 -0.060641
H  -0.350524 0.106803 0.519755
H  1.195893 1.393692 -0.655886
H  3.387143 -2.34787 -0.52018
H  -0.915878 -1.25564 -2.219944
H  -3.023512 -1.199132 -1.871741
H  3.059543 2.54666 0.524906
H  5.28197 -1.185254 0.70087
H  -4.583215 2.071941 1.587063
H  -5.439694 -0.623801 -1.721005
H  -6.241886 1.015728 0.019179
H  5.209503 2.283117 1.524508
