program: Gaussian 09
title: 000224567
version: EM64L-G09RevD.01
frameworkgroup: C1[X(C10H9NO2)]
method: RPBEPBE
basis: SDD
operation: Freq
keyword: #p
keyword: freq=noraman
keyword: PBEPBE/SDD
title: #p freq=noraman PBEPBE/SDD
converged: NO YES NO YES
title: Mulliken charges:
elementType: O O N C C C C C C C C C C H H H H H H H H H
charge: -0.438153 -0.275581 -0.397307 0.265949 0.140307 0.176327 0.057543 0.009151 -0.370392 -0.348484 -0.770695 -0.218093 -0.235875 0.329163 0.272618 0.274727 0.255332 0.209576 0.255316 0.229639 0.232171 0.346763
chargesum: 0.00000
title: Mulliken charges with hydrogens summed into heavy atoms:
elementType: O O N C C C C C C C C C C
charge: -0.091390 -0.275581 -0.068143 0.265949 0.140307 0.176327 0.057543 0.009151 -0.097775 -0.073758 -0.050471 0.011545 -0.003705
polarizability: 1.78551205e+02 -6.18888217e+00 1.41502894e+02 5.57297307e-04 4.44002864e-04 5.27272249e+01
1716.lowfreq: -32.0976 -0.0007 -0.0004 0.0003 8.6401 14.0989 16.1812 87.9332 133.0000
frequency: -31.6675 87.9144 132.9978 154.7734 201.6610 249.2234 256.0006 303.9599 340.3757 375.0191 420.4920 426.9701 461.8005 489.1539 515.4287 605.2025 627.7104 635.2266 644.2776 700.0916 722.4712 782.0087 791.5573 797.8913 903.2822 912.7188 986.3300 995.9333 1006.8603 1028.4245 1038.3935 1081.2719 1118.8229 1161.9122 1166.1616 1184.0872 1256.5420 1268.4415 1288.1448 1374.6221 1398.8590 1408.4828 1424.1321 1452.1119 1461.4361 1477.5468 1492.5423 1559.1689 1612.9597 1630.5532 1651.6357 2970.3907 3047.6824 3072.6631 3132.1032 3148.4489 3165.1784 3177.6754 3515.9986 3599.3696
redmass: 1.0304 3.8806 4.6453 5.3949 1.5309 4.5324 2.0923 3.5614 6.3892 6.4979 6.5346 3.2496 7.8289 3.6941 7.4159 4.0776 4.1127 1.8128 5.7798 6.2784 1.8855 1.8910 4.8581 2.4672 1.4600 3.8924 1.3739 1.7225 1.3299 2.2367 1.4515 2.5814 3.7776 1.4499 1.4760 1.4211 2.6390 2.0947 2.7576 1.8842 8.0846 1.4848 2.0608 2.6356 1.0411 1.0950 3.7836 7.0003 5.3300 5.8601 7.3277 1.0376 1.0991 1.0963 1.0862 1.0905 1.0968 1.0971 1.0767 1.0655
irintensity: 2.2955 3.4110 1.2606 1.8134 82.0234 5.4637 53.3739 3.4834 9.8872 1.5326 0.1736 2.9829 0.1982 0.2501 0.5480 10.0115 2.2906 12.0877 1.9988 12.9019 105.4232 65.7616 6.9223 9.7453 0.2509 59.9897 4.1926 2.3868 0.0272 10.4320 4.9457 13.6288 88.4603 75.0546 5.5854 23.5997 44.7269 6.3520 21.7743 4.0737 41.5555 15.4928 10.5704 4.3999 15.8025 19.6746 22.1513 17.3150 202.0233 206.0121 73.4547 47.1403 14.5012 26.2773 6.9607 9.8278 15.0875 12.1608 43.9248 19.7990
temp: 298.150 k
press: 1.00000 atm
elementType: 8 8 7 6 6 6 6 6 6 6 6 6 6 1 1 1 1 1 1 1 1 1
symmnumber: 1
zpe: 441978.9 jmol-1
zpe.correction: 0.168341 hartree
zpe.thermalcorrener: 0.178690 hartree
zpe.thermalcorrenthalpy: 0.179634 hartree
zpe.thermalcorrgfe: 0.132726 hartree
zpe.sumelectzpe: -590.768530 hartree
zpe.sumelectthermal: -590.758180 hartree
zpe.sumelectthermalent: -590.757236 hartree
zpe.sumelectthermalfe: -590.804144 hartree
dipole: -3.6775 -3.2382 -0.0006
dipole: 4.8999
quadrupole: -50.5713 -85.3204 -79.0745
quadrupole: -0.5738 0.0014 0.0017
quadrupole: 21.0841 -13.6650 -7.4191 -0.5738 0.0014 0.0017
hfenergy: -590.9368706 hartree
pointgroup: C01[X(C10H9N1O2)]
dipole: 1.4053486 1.3196011 -0.0010528 debye
dipolederiv: -0.1828974 -0.2787741 0.000099 -0.2885808 -1.1899262 0.0005918 0.0001194 0.0004796 -0.3999412 -0.4621298 -0.0697146 0.0000439 -0.1010857 -1.4391895 0.0007963 0.0000697 0.0007848 -0.3788021 -0.5331211 -0.6429857 0.0004546 0.3313273 -0.5991293 0.0002851 -0.0002836 0.0001695 -0.2864757 0.5209313 -0.0504649 0.0000969 -0.0679484 -0.0558011 0.0000709 0.0000966 0.0000985 0.0477133 -0.1248654 0.342252 -0.0002743 -0.0061261 -0.3379267 0.0002593 -0.0000138 0.0003059 0.0026732 0.2694198 0.2485403 -0.0001313 -0.6339491 0.3484281 -0.000374 0.000601 -0.0003049 -0.0397292 -0.3026821 0.180613 -0.0001379 0.4086168 0.9749361 -0.0006958 -0.0003259 -0.0006833 -0.0041457 0.7128359 0.3063964 -0.0001735 0.0559456 1.6160221 -0.0010971 0.0000099 -0.0010588 0.1720246 -0.3605142 0.0154151 -0.0000357 0.1076075 0.0618176 -0.0001536 -0.0001008 -0.0001641 -0.157628 -0.0637552 -0.1761483 0.0001414 0.1272405 0.0748171 -0.0001252 -0.0000879 -0.000167 -0.1117477 -0.030787 -0.0682559 0.0000319 0.0449055 0.0194569 0.000066 -0.0001288 0.0000696 0.1022324 0.187534 -0.0369845 0.0000739 -0.0000543 0.1765992 -0.0002412 0.0000461 -0.0002466 -0.1407136 0.0669981 0.1562675 -0.0000849 -0.0444095 -0.2007825 0.0000177 0.0000656 0.0000442 -0.172233 0.184673 -0.0092687 -0.0000053 -0.0165432 0.1612531 0.0001076 0.0000077 0.0001081 0.3063569 0.1070966 -0.0422998 0.0000212 -0.0101922 -0.0258733 0.0001447 0.000001 0.0001404 0.1647598 0.1063042 0.0018438 -0.0000077 -0.0664948 -0.0021908 0.0001111 0.0000445 0.0001212 0.1554562 -0.0369065 0.0293848 -0.0481195 0.0683208 0.0679175 0.090333 -0.1238102 0.0700761 -0.0280688 0.0760625 0.0124002 -0.0000217 -0.111253 -0.1649503 0.0002496 0.0000969 0.0002573 0.1174046 -0.0369184 0.0294885 0.0480649 0.0685822 0.0676201 -0.0904994 0.1236981 -0.0702482 -0.0277309 -0.0366129 0.1102898 -0.0001102 0.1210885 -0.0112704 0.0001423 -0.0001209 0.0001408 0.1540614 -0.1191215 -0.0477309 -0.0000024 -0.0565752 0.0729182 0.0000597 0.000005 0.0000606 0.1619319 0.0584562 -0.010264 0.0000768 0.0695776 0.3852541 -0.0000488 0.0000103 0.0000164 0.3626017 unknown
polarizability: 178.9088957|-4.9922199|141.1451495|0.0199406|-0.0677787|52.7272789 unknown
InChI: InChI=1S/C10H9NO2/c1-6-9(12)7-4-2-3-5-8(7)10(13)11-6/h2-5,11-12H,1H3
charge 0 multiplicity 1
22 atoms
O  1.309615 2.47288 -0.001345
O  0.144867 -2.991182 0.002584
N  1.672819 -1.234575 0.001432
C  -0.336655 0.704462 -0.000266
C  -0.687317 -0.685963 0.000738
C  2.058784 0.118265 0.000478
C  1.066184 1.082137 -0.00037
C  0.355108 -1.735902 0.001662
C  -1.375078 1.680962 -0.001147
C  -2.052255 -1.073444 0.000845
C  3.549327 0.369207 0.000507
C  -2.720827 1.279737 -0.001031
C  -3.065678 -0.100927 -0.000033
H  2.401501 -1.954828 0.002051
H  -1.100214 2.739156 -0.001914
H  -2.277084 -2.145134 0.00163
H  4.02907 -0.071096 0.895684
H  3.805093 1.443329 -0.000442
H  4.029383 -0.072753 -0.893684
H  -3.512852 2.037014 -0.001719
H  -4.11864 -0.402268 0.000049
H  2.277948 2.668121 -0.001708
