program: Gaussian 09
title: 000224565
version: EM64L-G09RevD.01
frameworkgroup: C1[X(C8H10N2O3)]
method: RPBEPBE
basis: SDD
operation: Freq
keyword: #p
keyword: freq=noraman
keyword: PBEPBE/SDD
title: #p freq=noraman PBEPBE/SDD
converged: YES YES NO NO
title: Mulliken charges:
elementType: O O O N N C C C C C C C C H H H H H H H H H H
charge: -0.475576 -0.427152 -0.272528 -0.012675 -0.677596 0.221919 0.169373 0.146090 0.055229 -0.499509 -0.477074 -0.799513 0.091357 0.235489 0.284514 0.284402 0.225617 0.271843 0.226787 0.319442 0.368847 0.356566 0.384149
chargesum: 0.00000
title: Mulliken charges with hydrogens summed into heavy atoms:
elementType: O O O N N C C C C C C C C
charge: -0.119011 -0.043004 -0.272528 -0.012675 0.010693 0.221919 0.169373 0.146090 0.055229 0.020494 -0.192672 -0.075266 0.091357
polarizability: 1.59849590e+02 -4.58607532e-01 1.27201050e+02 -1.48944149e+00 2.12525731e+00 6.01616537e+01
1716.lowfreq: -5.9677 -5.1331 0.0006 0.0009 0.0009 4.2963 35.2785 76.9105 98.0596
frequency: 35.2388 76.9049 98.0579 108.4950 167.8388 208.8171 218.9176 280.5142 300.0284 321.9958 334.9130 347.9670 388.8960 410.7456 431.9377 493.3837 530.6752 545.4873 574.5800 601.1269 614.4404 662.8920 714.5898 719.6403 732.1746 767.5751 866.0755 909.3794 915.3373 924.6788 967.2175 996.4298 1038.0545 1088.3962 1156.2371 1159.2846 1221.9360 1245.8818 1266.0565 1316.1061 1329.3851 1351.1805 1359.2006 1387.3762 1436.1476 1443.5419 1459.3180 1469.7369 1474.0179 1547.2726 1563.9602 1622.7720 1628.1229 2959.4380 3021.7180 3029.7909 3117.8370 3119.4147 3178.8680 3433.8522 3522.4615 3576.7913 3657.3046
redmass: 10.4529 3.9756 3.3581 4.7346 1.0657 5.0630 4.8780 2.7025 4.1605 3.3703 3.3828 5.8970 1.4379 3.9246 1.1754 3.8155 3.3068 3.6194 4.7190 4.8186 1.4619 5.1856 1.8213 2.3075 3.9308 3.8989 3.2105 1.5677 6.8651 2.1203 2.4481 1.8488 1.5577 2.0680 1.3133 1.8683 2.7089 3.1278 2.9333 1.9005 1.5267 2.9609 1.3213 1.3265 3.9812 1.7983 1.0883 1.0835 1.5395 7.3060 4.8389 3.0932 1.6097 1.0400 1.0629 1.0970 1.1015 1.0954 1.0921 1.0554 1.0640 1.0664 1.0939
irintensity: 1.7654 0.4264 1.6279 3.8046 1.0488 5.5975 1.8061 3.4659 0.4548 1.2002 25.0369 5.5294 110.9681 13.7857 112.3887 38.0624 26.3140 30.4525 16.3162 38.5978 91.0823 15.0119 74.4236 37.6580 101.6578 6.3785 9.1041 37.5830 94.0203 10.1138 96.2081 95.9462 4.4904 169.3273 70.3414 9.4970 12.5675 35.9931 11.2104 56.0681 28.4271 4.6747 4.2910 40.0453 125.9384 48.3865 32.6281 15.9639 32.7751 22.6370 22.4167 265.2396 204.8081 24.1888 22.7911 22.0143 3.2440 5.6981 0.8447 131.0877 48.7023 11.9855 50.8763
temp: 298.150 k
press: 1.00000 atm
elementType: 8 8 8 7 7 6 6 6 6 6 6 6 6 1 1 1 1 1 1 1 1 1 1
symmnumber: 1
zpe: 463244.4 jmol-1
zpe.correction: 0.176440 hartree
zpe.thermalcorrener: 0.189128 hartree
zpe.thermalcorrenthalpy: 0.190072 hartree
zpe.thermalcorrgfe: 0.137353 hartree
zpe.sumelectzpe: -645.068031 hartree
zpe.sumelectthermal: -645.055344 hartree
zpe.sumelectthermalent: -645.054400 hartree
zpe.sumelectthermalfe: -645.107119 hartree
dipole: -1.3970 1.0908 -0.4367
dipole: 1.8254
quadrupole: -61.5217 -85.4349 -74.6828
quadrupole: -7.5987 0.1530 -1.5404
quadrupole: 12.3581 -11.5551 -0.8030 -7.5987 0.1530 -1.5404
hfenergy: -645.2444719 hartree
pointgroup: C01 [X(C8H10N2O3)]
dipole: 0.4600729 -0.5249228 -0.1689922 debye
dipolederiv: -0.4410768 -0.1956172 0.145026 -0.244533 -0.8351864 -0.1500007 0.0957635 -0.2487007 -0.4026269 -0.6092701 0.4405004 0.0615071 0.6065073 -1.0763412 -0.0853888 0.1047206 -0.0741938 -0.4229823 -1.0739534 -0.2341777 -0.0189831 -0.2003654 -0.8279777 -0.0391636 -0.0278037 -0.0353013 -0.3298876 -0.2967683 0.0394871 -0.0109192 -0.0632254 -0.3063158 0.013309 -0.0253964 0.0218862 -0.2469513 -0.5359995 0.4344791 -0.0474414 0.5811539 -1.0372165 0.0779579 -0.1656254 0.1756734 -0.6399445 0.0605838 0.367091 -0.055115 -0.3353899 -0.0938011 -0.0501203 -0.0068418 -0.0548329 -0.1186413 -0.0806599 -0.7358374 0.0946488 -1.0070674 0.7424946 -0.0235441 0.1118673 0.0000303 0.1123665 -0.8237385 -0.0645198 0.04915 0.1945658 0.0649417 -0.0398198 0.0459858 -0.0064895 0.0315441 0.7338783 -0.0820007 -0.011369 0.4565963 -0.0079978 -0.032637 -0.0617073 -0.0292161 -0.0085287 0.2469686 0.1316767 -0.0448705 0.1966516 0.5217684 0.1290291 -0.0042805 0.2097462 0.395717 0.0421592 -0.0622932 0.0040775 0.0114832 0.0025792 -0.0277246 0.0455769 -0.0064787 -0.079769 -0.2885885 0.008101 0.014972 0.0593039 0.0274674 0.0050603 0.0382627 0.0029202 0.0764799 1.994162 -0.1502641 -0.0537771 -0.2567549 1.4752428 0.1539847 -0.0730388 0.1177339 0.238586 0.0915971 0.0524019 -0.099008 -0.0397008 -0.0248948 0.0528737 -0.0330694 0.0048662 -0.0568892 -0.0100812 -0.0568234 0.0595836 0.017576 0.1058486 -0.0610935 0.017508 -0.0644441 0.0804753 0.0657365 0.0419472 -0.0053762 0.0639773 0.0175026 0.0224402 -0.0440131 0.0118919 0.1479514 -0.0087098 0.0062352 0.038728 0.0712452 0.0329475 -0.1264101 0.0848537 -0.08298 -0.0279681 0.1001423 -0.0086887 0.0020241 -0.1159691 -0.0509853 0.0270854 0.0164103 0.0216769 0.1185867 -0.0105127 0.0005727 -0.0405675 0.0510539 0.0764404 0.0931189 -0.1047314 0.0571694 -0.0593246 0.159982 -0.0537938 0.0149835 -0.0488057 0.2127439 -0.0076482 0.0497955 -0.01121 0.3337063 0.2703025 0.0937317 0.0115631 0.0329956 0.3179327 -0.0002029 0.0700498 -0.0674852 0.330813 0.2445939 0.0958816 -0.0960301 0.1273411 0.3352079 0.0771001 -0.0834965 0.0537864 0.1343411 0.1692527 -0.0680897 -0.0128067 -0.1586397 0.3275989 -0.0082055 -0.0507898 0.0039513 0.392946 unknown
polarizability: 158.6420051|-6.1675558|127.9685896|-3.1130462|-5.198217|60.6016993 unknown
InChI: InChI=1S/C8H10N2O3/c1-4-7(9)6(3-11)5(2-10-4)8(12)13/h2,11-12H,3,9H2,1H3
charge 0 multiplicity 1
23 atoms
O  -0.377676 -3.105721 -0.216038
O  -2.733657 1.982497 0.256576
O  -3.109355 -0.285621 0.037299
N  1.308898 1.77791 -0.215518
N  2.04619 -1.83218 0.23027
C  -0.098852 -0.665616 0.265572
C  1.327845 -0.648354 0.123003
C  -0.795713 0.569707 0.104167
C  1.99537 0.608485 -0.087305
C  -0.747415 -1.974893 0.686161
C  -0.048984 1.755175 -0.141888
C  3.503505 0.675368 -0.160921
C  -2.280874 0.658479 0.134134
H  -0.331103 -2.290303 1.660075
H  -1.84068 -1.889425 0.756062
H  -0.564314 2.707739 -0.281574
H  3.89951 0.073621 -1.003943
H  3.807108 1.722305 -0.30886
H  3.978866 0.301264 0.768096
H  3.060115 -1.822804 0.165579
H  1.533827 -2.709753 0.088831
H  -0.82828 -2.974585 -1.087649
H  -3.728431 1.974004 0.229272
