program: Gaussian 09
title: 000019099
version: EM64L-G09RevD.01
frameworkgroup: C1[X(C15H14N2O)]
method: RPBEPBE
basis: SDD
operation: Freq
keyword: #p
keyword: freq=noraman
keyword: PBEPBE/SDD
title: #p freq=noraman PBEPBE/SDD
converged: YES YES NO NO
title: Mulliken charges:
elementType: O N N C C C C C C C C C C C C C C C H H H H H H H H H H H H H H
charge: -0.278167 -0.376413 -0.649435 -0.513139 -0.600888 0.321740 0.418737 0.214989 0.158457 -0.343613 -0.430649 -0.311440 -0.353419 0.211492 -0.260084 -0.236287 -0.249052 -0.231164 0.232495 0.231012 0.236978 0.213185 0.228449 0.242348 0.261915 0.266200 0.226632 0.230157 0.228538 0.232928 0.338081 0.339418
chargesum: 0.00000
title: Mulliken charges with hydrogens summed into heavy atoms:
elementType: O N N C C C C C C C C C C C C C C C
charge: -0.278167 -0.376413 0.028064 -0.049632 -0.150725 0.321740 0.418737 0.214989 0.158457 -0.115164 -0.188300 -0.049525 -0.087219 0.211492 -0.033452 -0.006131 -0.020514 0.001764
polarizability: 2.14993754e+02 -5.01908483e+00 1.69666775e+02 -6.34979466e-01 1.65963939e+01 1.28320195e+02
1716.lowfreq: -11.6744 -0.0009 -0.0002 0.0004 7.8568 17.2188 51.1449 71.2729 76.6872
frequency: 51.0864 71.2251 76.6838 88.2482 123.5849 150.5781 190.7011 260.6785 280.5160 306.9679 335.2195 361.5485 384.8508 435.2231 443.4087 454.7217 467.2924 477.3120 514.4309 520.8373 545.1553 568.3325 590.3440 596.3850 638.6723 675.2238 707.9484 714.2835 743.5138 760.2737 768.3594 773.7367 778.7587 857.4751 877.8704 896.4137 926.0022 945.0792 951.6291 972.8542 981.8047 989.2553 994.3449 1026.9228 1035.8901 1047.8170 1055.1443 1105.3822 1112.9654 1165.3056 1173.2914 1174.3201 1187.9679 1205.0186 1223.3772 1227.8519 1262.3810 1284.7159 1300.6755 1325.6430 1353.1980 1355.9075 1380.2909 1382.2045 1433.7252 1442.4171 1449.5044 1467.4570 1484.4596 1490.3415 1571.9158 1585.5481 1592.3765 1606.7016 1612.2639 1639.9891 2965.6502 2993.2940 3018.2932 3055.3823 3111.4607 3123.6863 3135.7202 3135.8260 3148.9726 3156.6234 3165.9625 3179.6836 3540.4120 3698.7908
redmass: 4.4567 5.8244 4.8582 4.1862 4.0845 3.6029 3.4892 4.1253 3.2063 4.7219 4.3664 3.8727 4.8928 2.9077 2.7672 1.3498 2.8246 3.6904 1.2265 3.7199 3.9528 4.1529 3.3636 3.3246 6.3924 5.2331 4.1265 4.4649 2.7863 1.8724 2.2906 1.8455 2.6334 1.3687 1.3670 2.4291 3.4845 1.5016 1.4737 2.2103 1.3468 1.4688 4.1175 2.6308 2.0737 2.0181 2.0543 1.8683 1.8867 1.1206 1.1085 1.1134 1.7795 2.7435 1.4514 2.2149 1.6401 1.4550 2.4243 1.4756 1.8781 4.4637 4.1977 6.7523 2.2775 2.2532 1.1480 1.1435 2.7381 2.4670 1.4857 6.7626 6.6701 6.5075 5.3709 3.9720 1.0608 1.0641 1.0955 1.1023 1.0877 1.0868 1.0889 1.0888 1.0943 1.0964 1.1007 1.0969 1.0450 1.1042
irintensity: 0.4884 0.3059 5.9742 1.5135 0.6351 1.9220 7.6539 1.1998 2.4001 1.3492 2.8225 3.8286 7.5136 12.2907 2.0956 162.0662 7.7196 6.6395 47.2139 1.9099 1.3605 6.6448 5.6175 34.1709 11.4561 0.3815 11.1802 10.3857 14.9247 24.9500 29.3338 26.2211 36.5770 2.1477 3.2187 7.6032 0.4085 0.5226 0.0821 2.5311 0.3062 0.5769 1.1645 5.9431 4.7179 6.2935 8.7461 14.5934 10.9672 2.2000 1.6463 0.0612 3.2272 11.2972 5.9577 7.7318 14.5703 8.4371 20.4560 3.3693 15.0886 486.0533 8.4787 10.0002 11.8322 5.3441 15.6535 17.7823 81.9939 48.6057 217.8666 20.4835 1.2438 1.3591 13.4331 283.0862 25.9104 19.2775 36.4303 24.0638 10.5512 4.4332 4.2054 15.6507 21.9186 34.5838 22.4480 6.5731 35.0659 57.4122
temp: 298.150 k
press: 1.00000 atm
elementType: 8 7 7 6 6 6 6 6 6 6 6 6 6 6 6 6 6 6 1 1 1 1 1 1 1 1 1 1 1 1 1 1
symmnumber: 1
zpe: 672549.9 jmol-1
zpe.correction: 0.256161 hartree
zpe.thermalcorrener: 0.270687 hartree
zpe.thermalcorrenthalpy: 0.271631 hartree
zpe.thermalcorrgfe: 0.214888 hartree
zpe.sumelectzpe: -763.488704 hartree
zpe.sumelectthermal: -763.474179 hartree
zpe.sumelectthermalent: -763.473234 hartree
zpe.sumelectthermalfe: -763.529977 hartree
dipole: 3.9135 -2.3823 0.4498
dipole: 4.6036
quadrupole: -95.1241 -101.3127 -102.8043
quadrupole: 8.9539 -3.7970 7.5214
quadrupole: 4.6229 -1.5657 -3.0572 8.9539 -3.7970 7.5214
hfenergy: -763.7448651 hartree
pointgroup: C01 [X(C15H14N2O1)]
dipole: -1.5464318 0.9235164 0.1900965 debye
polarizability: 215.0448312|-4.6750054|170.3423948|1.0811671|-15.6574237|127.5934976 unknown
InChI: InChI=1S/C15H14N2O/c16-15(18)17-13-7-3-1-5-11(13)9-10-12-6-2-4-8-14(12)17/h1-8H,9-10,16H2
charge 0 multiplicity 1
32 atoms
O  1.095556 -2.781262 -1.031475
N  0.013594 -0.881335 -0.130036
N  -1.225442 -2.707818 -1.005016
C  0.528144 2.010426 -1.153474
C  -0.758068 1.341413 -1.702572
C  1.482609 1.155891 -0.311559
C  -1.658803 0.876865 -0.578291
C  1.259659 -0.181709 0.126539
C  -1.231654 -0.223926 0.211261
C  2.714435 1.769069 0.047367
C  -2.872031 1.522269 -0.240441
C  2.261417 -0.867665 0.862173
C  -1.997153 -0.666497 1.315509
C  0.028871 -2.166753 -0.735759
C  3.707749 1.092511 0.779633
C  -3.649714 1.077103 0.853402
C  3.481319 -0.244309 1.181773
C  -3.212104 -0.018663 1.63392
H  0.22896 2.894036 -0.553191
H  1.105174 2.40568 -2.012758
H  -0.475876 0.484536 -2.343487
H  -1.28886 2.071816 -2.340201
H  2.894017 2.802164 -0.277559
H  -3.20975 2.375781 -0.840217
H  2.073375 -1.901133 1.163253
H  -1.63061 -1.503906 1.918822
H  4.648046 1.596539 1.028235
H  -4.588918 1.584246 1.100324
H  4.244064 -0.793687 1.743911
H  -3.805341 -0.358578 2.489728
H  -1.235556 -3.624804 -1.443508
H  -2.098506 -2.2257 -0.803308
