program: Gaussian 09
title: 000224534
version: EM64L-G09RevD.01
frameworkgroup: C1[X(C18H23NO)]
method: RPBEPBE
basis: SDD
operation: Freq
keyword: #p
keyword: freq=noraman
keyword: PBEPBE/SDD
title: #p freq=noraman PBEPBE/SDD
converged: YES YES NO NO
title: Mulliken charges:
elementType: O N C C C C C C C C C C C C C C C C C C H H H H H H H H H H H H H H H H H H H H H H H
charge: -0.440659 -0.101325 0.020666 0.496357 0.449045 -0.760627 -0.759298 -0.536009 0.320176 -0.436274 -0.480064 -0.388502 -0.416543 0.074159 -0.411168 -0.243670 -0.242715 -0.249276 -0.630007 -0.613929 0.206763 0.234615 0.231153 0.234598 0.208919 0.229306 0.294038 0.247875 0.226035 0.227371 0.246505 0.240510 0.211781 0.221670 0.220076 0.224881 0.246061 0.189300 0.219924 0.219769 0.186455 0.227985 0.354075
chargesum: 0.00000
title: Mulliken charges with hydrogens summed into heavy atoms:
elementType: O N C C C C C C C C C C C C C C C C C C
charge: -0.086584 -0.101325 0.020666 0.496357 0.449045 -0.088096 -0.086475 -0.241971 0.320176 -0.188399 -0.026658 -0.141997 -0.176033 0.074159 -0.199387 -0.022000 -0.022639 -0.024395 0.025277 0.020279
polarizability: 2.17237129e+02 2.15363847e+01 2.12871220e+02 1.17774778e+01 2.13675710e+00 1.71680818e+02
1716.lowfreq: -9.9292 -7.9197 -0.0006 -0.0006 -0.0004 7.4211 17.6124 36.2051 46.0047
frequency: 17.5639 36.1600 45.9965 50.0520 71.8969 79.1956 118.0585 160.8885 190.6739 208.8341 232.3200 238.2113 249.7215 259.4089 274.2309 285.2255 292.3204 314.8394 315.5263 339.2383 353.4941 360.1463 364.7133 403.7565 409.4133 427.4925 443.3678 487.5518 506.5519 550.0330 558.3146 600.8227 616.4456 619.2125 661.4387 706.6525 733.7805 759.6945 775.4151 785.6822 799.3858 822.3499 853.2086 885.0803 918.8602 921.7139 933.6403 939.3691 951.4050 977.0566 989.1966 990.5285 992.9470 1003.9843 1025.3803 1030.2435 1036.5517 1074.5968 1075.8733 1091.3788 1093.7243 1112.4892 1136.4150 1151.7465 1166.1528 1169.1603 1171.4007 1187.2870 1194.4897 1227.3208 1235.6297 1248.9001 1266.8220 1276.4310 1296.9638 1319.0576 1357.5838 1374.0113 1376.9283 1381.8790 1395.3064 1417.2366 1418.2317 1432.8867 1441.4532 1460.4257 1461.8843 1466.2608 1470.9032 1475.8204 1477.3962 1481.5326 1485.3485 1485.7035 1489.3275 1495.0141 1588.7204 1604.5534 1610.8518 1615.5502 2848.8892 2861.6696 2892.2082 2975.0307 2978.2483 2992.6636 3016.6119 3022.5738 3068.8280 3072.5033 3075.5636 3082.0583 3082.2525 3084.1260 3105.2625 3116.1350 3123.7366 3127.7006 3137.1659 3150.7442 3158.5635 3163.0378 3580.9294
redmass: 4.1051 4.0050 2.9401 3.8747 3.1076 3.5145 4.1391 3.5973 2.9344 3.1250 1.3094 1.0665 3.5556 2.4447 1.3775 2.9727 2.8773 1.7116 1.3779 2.6309 1.5658 1.7584 2.7070 2.8249 2.8373 3.1001 2.9563 3.5938 3.5022 4.4170 3.2024 4.5965 5.6399 3.6807 5.4218 1.6188 3.9028 3.0220 2.0229 5.4630 1.4818 4.5839 1.2486 3.2280 1.5722 1.4901 1.4128 1.5240 1.9531 1.3890 1.8840 3.1736 1.4650 1.3293 2.4741 2.2524 1.5449 1.7508 2.2087 1.2575 1.8040 1.9451 1.3984 2.3830 1.4655 1.6929 1.0590 1.8740 1.1172 2.1709 2.7536 2.7906 2.9431 1.8361 1.4862 1.3651 1.6311 2.2867 1.9330 5.0441 1.1944 2.5596 1.1916 2.2195 1.2226 1.0475 1.0708 1.0790 1.1230 1.0804 1.0634 1.6345 1.0684 1.0583 1.2050 2.4859 6.0078 6.6124 6.0816 6.8297 1.0567 1.0572 1.0682 1.0350 1.0358 1.0884 1.0723 1.0727 1.0993 1.0994 1.1010 1.1004 1.1001 1.0995 1.0893 1.0847 1.0873 1.0907 1.0931 1.0948 1.0928 1.0998 1.0659
irintensity: 0.0228 0.1067 0.2182 0.3909 0.8735 1.0184 0.3925 1.0044 0.5627 2.4638 1.0667 0.5195 3.7115 1.7039 0.8077 0.9153 3.1131 1.1169 1.6199 2.5978 53.1871 42.0088 34.1624 0.2557 3.7304 3.3848 4.0965 0.2608 10.9580 22.0515 8.0261 1.5726 2.5107 11.3955 1.3279 58.0316 2.3987 4.8291 40.5374 18.2713 39.8477 8.2257 0.2176 2.0871 0.8119 4.3108 2.0062 11.3117 2.9792 0.0705 4.9679 1.6134 1.0776 2.5126 18.5292 47.9742 19.4305 18.1850 91.5179 6.8226 48.8112 25.9353 5.1197 37.4122 19.0206 0.8775 0.0414 7.6674 2.1461 19.4170 12.8163 104.4959 12.2456 4.0484 20.6444 1.6266 9.5578 13.4370 20.7992 22.0711 12.6524 4.3737 4.2894 8.5725 5.9597 13.1632 3.7782 6.4157 5.4165 26.8580 5.7721 10.4979 11.1834 9.0344 14.2325 90.5565 1.1445 0.6782 8.5660 12.1996 81.4014 189.8056 80.4988 24.7391 30.4799 19.8293 35.1547 35.8069 14.8038 59.8625 26.1400 18.2112 60.1158 37.8027 24.7603 4.3435 1.5355 3.2767 29.3883 39.3627 14.5351 18.9703 30.8307
temp: 298.150 k
press: 1.00000 atm
elementType: 8 7 6 6 6 6 6 6 6 6 6 6 6 6 6 6 6 6 6 6 1 1 1 1 1 1 1 1 1 1 1 1 1 1 1 1 1 1 1 1 1 1 1
symmnumber: 1
zpe: 953737.1 jmol-1
zpe.correction: 0.363259 hartree
zpe.thermalcorrener: 0.383416 hartree
zpe.thermalcorrenthalpy: 0.384361 hartree
zpe.thermalcorrgfe: 0.314099 hartree
zpe.sumelectzpe: -828.181359 hartree
zpe.sumelectthermal: -828.161202 hartree
zpe.sumelectthermalent: -828.160258 hartree
zpe.sumelectthermalfe: -828.230520 hartree
dipole: -0.8159 -1.2035 0.1970
dipole: 1.4672
quadrupole: -118.0289 -106.7684 -115.9713
quadrupole: 5.6058 2.1130 3.4147
quadrupole: -4.4394 6.8211 -2.3818 5.6058 2.1130 3.4147
hfenergy: -828.5446188 hartree
pointgroup: C01 [X(C18H23N1O1)]
dipole: 0.3141374 -0.4768243 -0.0847678 debye
polarizability: 214.479351|-22.2189782|214.2010832|13.282544|-1.4600674|173.1087328 unknown
InChI: InChI=1S/C18H23NO/c1-18(2,15-8-6-5-7-9-15)16-10-11-17(20)14(12-16)13-19(3)4/h5-12,20H,13H2,1-4H3
charge 0 multiplicity 1
43 atoms
O  3.758534 -1.838351 1.337348
N  2.739382 1.995414 -0.142376
C  -1.418535 -0.979276 -1.145371
C  -0.060713 -1.266287 -0.455757
C  -2.207939 0.082918 -0.335767
C  -1.119329 -0.510259 -2.600041
C  -2.31586 -2.249753 -1.23331
C  0.813546 -0.183133 -0.171943
C  2.084677 -0.360973 0.410652
C  0.377646 -2.570344 -0.126509
C  2.9915 0.823442 0.72947
C  -2.354287 -0.084569 1.068495
C  -2.849505 1.192113 -0.94156
C  2.489339 -1.683694 0.733704
C  1.643629 -2.78132 0.466731
C  -3.115242 0.819021 1.838578
C  -3.61217 2.103743 -0.173014
C  -3.751875 1.921313 1.219801
C  3.232145 1.790964 -1.51992
C  3.237327 3.253812 0.444479
H  -2.049957 -0.368273 -3.180411
H  -0.549926 0.4362 -2.61458
H  -0.513837 -1.276521 -3.116042
H  -3.287686 -1.985223 -1.686416
H  -1.848587 -3.029246 -1.863639
H  -2.51813 -2.67726 -0.23495
H  0.518755 0.848229 -0.399368
H  -0.258773 -3.438271 -0.322795
H  2.808087 1.138793 1.776568
H  4.055901 0.487761 0.692367
H  -1.849383 -0.923741 1.562014
H  -2.757339 1.360519 -2.019185
H  1.965834 -3.800339 0.721117
H  -3.208953 0.668361 2.920396
H  -4.09471 2.956332 -0.665283
H  -4.341306 2.627434 1.815652
H  2.784445 0.876056 -1.944846
H  4.345971 1.687674 -1.574928
H  2.933657 2.646281 -2.152581
H  2.958399 4.100742 -0.208323
H  4.349286 3.27702 0.577945
H  2.770128 3.41671 1.43223
H  3.952954 -2.796023 1.490765
