program: Gaussian 09
title: 000224578
version: EM64L-G09RevD.01
frameworkgroup: C1[X(C22H26N2)]
method: RPBEPBE
basis: SDD
operation: Freq
keyword: #pfreq=noraman
keyword: PBEPBE/SDD
title: #p freq=noraman PBEPBE/SDD
converged: NO YES NO NO
title: Mulliken charges:
elementType: N N C C C C C C C C C C C C C C C C C C C C C C H H H H H H H H H H H H H H H H H H H H H H H H H H
charge: -0.088339 -0.018902 -0.364683 -0.355140 -0.360596 -0.400142 -0.393001 -0.397716 -0.481340 -0.445847 0.104014 0.411129 0.395489 -0.269896 -0.355263 -0.401605 -0.420675 -0.394448 -0.241029 -0.232044 -0.243291 -0.240782 -0.240747 -0.244926 0.174279 0.229432 0.209356 0.167599 0.193815 0.202889 0.193516 0.199640 0.200537 0.192655 0.213052 0.190026 0.236944 0.232837 0.250658 0.211429 0.243403 0.257683 0.260063 0.248381 0.228174 0.228925 0.226672 0.227237 0.230274 0.230303
chargesum: 0.00000
title: Mulliken charges with hydrogens summed into heavy atoms:
elementType: N N C C C C C C C C C C C C C C C C C C C C C C
charge: -0.088339 -0.018902 0.039028 0.021815 0.036108 -0.006986 0.000191 0.005363 -0.011559 0.016240 0.104014 0.411129 0.395489 -0.269896 -0.111859 -0.143921 -0.160612 -0.146066 -0.012854 -0.003119 -0.016619 -0.013545 -0.010473 -0.014624
polarizability: 2.36530522e+02 1.56884729e+00 2.48002953e+02 -5.97732999e+00 1.21350253e+01 2.18935472e+02
1716.lowfreq: -24.0631 -6.9404 0.0004 0.0006 0.0008 3.3880 10.3159 19.5599 25.1216
frequency: -15.1837 19.4014 24.8012 28.4599 40.5685 59.8510 73.7156 84.4490 110.6228 125.1042 150.2747 197.0245 219.2908 230.7758 244.4760 251.6443 259.5432 290.2237 308.4551 319.7554 373.7024 390.2492 396.7112 400.6191 404.5408 417.9924 443.7678 461.3752 499.5152 508.1424 536.7665 544.3254 615.3928 616.2618 629.4965 650.1750 693.9545 702.6345 707.8947 723.3774 760.9138 772.2778 791.9153 801.9864 848.1828 851.2928 851.9025 857.0976 864.4657 894.1618 906.4269 915.8633 929.3541 932.5528 958.0016 970.9312 978.4531 981.6660 990.6979 991.4641 996.6286 997.5197 1016.3768 1027.6394 1031.0368 1044.3538 1056.2278 1059.2608 1086.5499 1092.1682 1095.9813 1110.4741 1117.6465 1124.7593 1148.8251 1153.2735 1162.1926 1173.4323 1174.5067 1179.9744 1196.4465 1199.0362 1204.3692 1234.3941 1250.6351 1264.3461 1268.4625 1287.2024 1297.0468 1307.0663 1324.3657 1326.5905 1329.7094 1338.8662 1340.2147 1348.8408 1360.8953 1371.1354 1378.4121 1380.8445 1390.4607 1434.6598 1435.8481 1449.4436 1459.5371 1459.6966 1464.4959 1469.1959 1471.6893 1480.3547 1481.9427 1482.7610 1485.9669 1590.9704 1592.8691 1607.9118 1611.6863 2180.2184 2816.7443 2824.8272 2846.8677 2968.6422 2982.7560 2983.3137 2988.9649 2993.5015 2999.1887 3020.0939 3032.7286 3039.6444 3042.8530 3045.1728 3052.7860 3066.3166 3123.1645 3123.4669 3129.0422 3130.3806 3139.7129 3143.5989 3148.9788 3157.8931 3164.6060 3168.9319
redmass: 4.3850 3.7699 3.0573 3.9633 3.8701 4.7419 4.4095 4.5467 7.6058 6.9034 3.3926 3.8445 1.9282 4.1267 2.4377 2.7828 3.1652 3.7810 2.1504 3.0932 2.7720 2.2446 4.8833 2.8080 2.8455 3.8271 2.9300 7.9722 3.5132 2.8323 3.8386 1.8192 6.2561 6.4061 5.1137 5.4764 4.7154 1.7086 1.6680 2.3423 1.9241 1.8171 1.6616 1.4848 2.4990 1.2945 1.6469 1.2493 2.5651 2.0249 2.2886 1.8737 1.6547 1.6517 1.2979 2.5511 1.4195 1.4065 5.6831 5.9642 1.3228 1.3429 2.7038 2.3267 2.2068 2.7293 2.0970 1.8433 1.6427 2.0702 1.9834 1.9819 2.5287 2.4237 1.4108 1.8888 1.8083 1.0526 1.0596 3.1007 1.1299 1.1431 2.1188 1.4093 1.5633 1.2536 1.2780 1.2865 1.2047 1.2695 1.3188 1.3359 1.2769 1.3959 1.4476 1.5205 1.4912 1.4136 6.7582 6.4449 1.4300 2.2134 2.2394 1.0903 1.0843 1.0878 1.0961 1.1047 1.0907 2.0577 1.1569 1.3659 1.4087 6.1223 6.0906 5.9766 5.9639 12.6635 1.0714 1.0708 1.0698 1.0619 1.0615 1.0616 1.0607 1.0658 1.0837 1.0873 1.0957 1.0939 1.1017 1.0923 1.1035 1.1029 1.0848 1.0856 1.0874 1.0880 1.0919 1.0932 1.0961 1.0958 1.1015 1.0995
irintensity: 0.1876 0.1209 0.1223 0.5148 0.1786 0.3811 0.2865 0.8751 2.1464 3.0674 0.3371 1.3848 0.2455 1.0196 1.1281 0.2114 0.9193 0.6666 4.7554 0.2379 0.6021 5.1109 0.4336 0.0855 0.0483 0.5341 0.4565 1.0732 5.0280 6.3234 10.2156 3.5030 0.3774 0.1455 8.3846 12.7828 0.5290 57.0145 68.1596 12.9976 41.3676 20.8567 16.2154 0.6409 2.8777 0.1898 4.6713 0.1913 1.8489 1.1825 2.2554 0.3363 5.5727 1.9862 3.0022 20.4705 1.2539 0.3701 1.1474 1.0922 0.0886 1.1221 6.5987 14.0064 4.3719 9.0423 7.6447 9.8904 1.7607 1.6139 2.2188 3.4717 23.8934 6.9411 9.6737 10.2412 7.6721 0.0647 0.1269 0.0865 1.6613 2.3725 3.3283 27.1777 10.2921 4.3401 14.2546 4.9574 4.4976 1.0992 0.2391 4.0419 6.4283 0.7778 9.0548 3.0841 8.5776 1.9057 0.9769 0.2664 1.5437 3.2342 16.8683 6.6675 5.8608 14.1945 3.8577 8.1515 7.0985 33.0285 2.8431 13.1194 11.5432 2.1087 0.7795 10.7241 3.3730 9.8865 43.4477 81.3052 210.3450 40.9016 27.1106 32.0477 8.9383 19.0010 24.8978 61.0915 73.7988 11.1085 35.9369 7.2622 103.7125 43.0581 1.5289 2.8618 0.8142 1.9270 11.3826 21.7934 26.5740 31.1871 24.2084 13.2964
temp: 298.150 k
press: 1.00000 atm
elementType: 7 7 6 6 6 6 6 6 6 6 6 6 6 6 6 6 6 6 6 6 6 6 6 6 1 1 1 1 1 1 1 1 1 1 1 1 1 1 1 1 1 1 1 1 1 1 1 1 1 1
symmnumber: 1
zpe: 1113403.5 jmol-1
zpe.correction: 0.424073 hartree
zpe.thermalcorrener: 0.445392 hartree
zpe.thermalcorrenthalpy: 0.446336 hartree
zpe.thermalcorrgfe: 0.371875 hartree
zpe.sumelectzpe: -961.658987 hartree
zpe.sumelectthermal: -961.637668 hartree
zpe.sumelectthermalent: -961.636724 hartree
zpe.sumelectthermalfe: -961.711186 hartree
dipole: 2.5572 -0.1137 -3.3673
dipole: 4.2298
quadrupole: -140.6346 -132.5224 -152.8649
quadrupole: 0.6368 12.2447 0.5778
quadrupole: 1.3727 9.4849 -10.8576 0.6368 12.2447 0.5778
hfenergy: -962.0830605 hartree
pointgroup: C01 [X(C22H26N2)]
dipole: 1.0046418 -0.0873935 1.3237759 debye
polarizability: 236.4414885|-1.8246605|245.9273409|6.1642867|14.1957473|221.1001178 unknown
InChI: InChI=1S/C22H26N2/c23-19-22(20-11-4-1-5-12-20,21-13-6-2-7-14-21)15-10-18-24-16-8-3-9-17-24/h1-2,4-7,11-14H,3,8-10,15-18H2
charge 0 multiplicity 1
50 atoms
N  3.200533 0.560816 -0.590681
N  -2.328016 -0.042759 -3.224753
C  3.429173 -0.756169 0.061327
C  4.451697 1.362446 -0.642974
C  2.581266 0.437556 -1.936152
C  3.978614 -0.582996 1.491978
C  5.028551 1.600709 0.767046
C  5.274768 0.256565 1.488544
C  1.135898 -0.108274 -1.90556
C  0.225106 0.740449 -0.997426
C  -1.219363 0.155696 -0.794217
C  -2.12558 1.091282 0.061857
C  -1.120976 -1.239268 -0.113448
C  -1.847929 0.034143 -2.135036
C  -3.495049 0.754314 0.220066
C  -1.380809 -2.445968 -0.8059
C  -1.629557 2.247464 0.709175
C  -0.716146 -1.301595 1.245068
C  -4.350211 1.554614 1.003919
C  -1.2388 -3.693048 -0.15314
C  -2.48579 3.049796 1.500288
C  -0.569426 -2.545109 1.894715
C  -3.847194 2.708675 1.650846
C  -0.830599 -3.748781 1.197488
H  4.148727 -1.376105 -0.538737
H  2.473384 -1.308419 0.099017
H  4.221015 2.329637 -1.128682
H  5.230377 0.85244 -1.272223
H  3.195988 -0.212502 -2.612014
H  2.573038 1.450077 -2.38682
H  4.158811 -1.580892 1.936186
H  3.210989 -0.076206 2.109167
H  4.307984 2.206856 1.3500
H  5.96786 2.181154 0.686202
H  5.630859 0.428904 2.521944
H  6.073942 -0.303349 0.959629
H  0.74888 -0.110545 -2.943253
H  1.131511 -1.161859 -1.570899
H  0.71202 0.833717 -0.009872
H  0.140691 1.761211 -1.418793
H  -3.89115 -0.139859 -0.276071
H  -1.698876 -2.41694 -1.854243
H  -0.58063 2.537438 0.603398
H  -0.533391 -0.374057 1.800144
H  -5.405582 1.280506 1.110667
H  -1.447922 -4.617746 -0.702593
H  -2.086157 3.942688 1.99424
H  -0.259521 -2.575626 2.945382
H  -4.509334 3.333014 2.260951
H  -0.722076 -4.714789 1.702946
