program: Gaussian 09
title: 000224527
version: EM64L-G09RevD.01
frameworkgroup: C1[X(C14H22ClN)]
method: RPBEPBE
basis: SDD
operation: Freq
keyword: #p
keyword: freq=noraman
keyword: PBEPBE/SDD
title: #p freq=noraman PBEPBE/SDD
converged: YES YES NO NO
title: Mulliken charges:
elementType: Cl N C C C C C C C C C C C C C C H H H H H H H H H H H H H H H H H H H H H H
charge: -0.085599 -0.431116 -0.376286 -0.364769 -0.372163 -0.457826 -0.353151 -0.351809 -0.356424 -0.695621 0.477168 -0.353102 -0.416621 -0.207498 -0.190383 -0.123453 0.192190 0.192225 0.195326 0.195332 0.190426 0.190414 0.209489 0.209872 0.188296 0.188269 0.212948 0.212851 0.195380 0.195377 0.297044 0.216436 0.209893 0.209899 0.244773 0.218858 0.245924 0.247428
chargesum: 0.00000
title: Mulliken charges with hydrogens summed into heavy atoms:
elementType: Cl N C C C C C C C C C C C C C C
charge: -0.085599 -0.134072 0.008129 0.025889 0.008678 -0.038465 0.023415 0.073990 0.034332 -0.059394 0.477168 -0.108328 -0.197763 0.038426 0.057045 -0.123453
polarizability: 2.65481540e+02 7.87434848e+00 1.51738709e+02 1.66898217e-01 -8.70698857e-02 1.01995436e+02
1716.lowfreq: 0.0018 0.0020 0.0022 4.2095 7.6780 17.4958 20.2813 31.0959 39.8866
frequency: 17.8282 31.0890 39.2233 45.1628 81.7849 84.0772 89.6793 117.3100 132.0021 148.3113 154.9021 160.8286 170.4398 227.8393 248.3290 299.5318 306.5705 317.3625 320.2682 403.1173 413.9609 421.6998 482.4535 496.5577 515.7535 626.7334 649.7736 690.3877 721.8927 729.0545 751.2169 792.4255 801.3738 810.8367 824.6951 865.7944 889.0783 923.6197 938.2544 945.2555 983.6342 993.5411 1012.9707 1014.4833 1047.7944 1068.9664 1073.5779 1080.1056 1081.4021 1100.4911 1114.6212 1136.9659 1156.4501 1183.6773 1190.1714 1219.4227 1228.8482 1258.3126 1263.4540 1283.1356 1283.3573 1287.1948 1297.3608 1298.5451 1298.9132 1314.0858 1339.9549 1355.3279 1357.8889 1364.3028 1374.2129 1388.6197 1413.3287 1461.9409 1462.2525 1466.4049 1468.9110 1470.8083 1476.4191 1476.9315 1483.5978 1488.5426 1498.1293 1506.8894 1584.0600 1621.5063 2923.1488 2951.0926 2952.1806 2956.6595 2959.1917 2959.6003 2966.8554 2969.7969 2971.5347 2985.2453 2993.1501 3004.0214 3017.5151 3032.1212 3044.0879 3068.0133 3070.9922 3119.8670 3149.1123 3164.6992 3170.6760 3570.6012
redmass: 4.3741 4.9592 1.7900 4.0725 1.8401 4.4246 2.7750 2.2763 2.4985 2.1779 5.1228 2.7456 4.3525 1.1239 4.6815 1.8551 4.0394 1.8976 4.6082 4.1359 3.0215 3.9829 3.1605 2.6107 3.6998 7.0443 6.6076 3.0410 1.0612 1.0806 1.1148 1.2323 1.2434 1.6763 5.1428 1.2051 1.8930 1.3239 1.3316 1.2013 4.1908 4.3677 4.1354 1.1068 3.3294 2.7071 2.7207 2.4777 2.0578 2.0689 1.7852 2.7552 1.5368 1.1123 1.6265 1.3010 1.3613 1.3196 1.2348 1.3952 1.0365 1.1314 1.0922 1.3580 1.1101 1.5508 1.5049 1.6543 1.7281 2.4853 1.8305 1.2175 4.3205 1.0769 1.0713 1.1191 1.4865 1.1418 1.0426 1.0831 1.0899 1.0924 1.5365 1.6454 5.4798 6.4778 1.0568 1.0589 1.0590 1.0592 1.1024 1.0596 1.0587 1.0583 1.0366 1.0969 1.0991 1.1020 1.1043 1.1050 1.1049 1.1007 1.0993 1.0894 1.0875 1.0951 1.0968 1.0770
irintensity: 0.2585 0.4232 0.3851 0.0039 2.3579 0.2567 0.0001 2.8897 1.1543 0.1363 0.2089 3.3385 0.0675 0.0000 0.1340 22.3201 0.5167 67.9675 2.6755 3.9002 0.1349 1.2271 2.1497 23.8341 1.2528 0.2826 40.6689 1.4040 15.4006 0.1532 5.8624 0.8497 8.7673 80.6230 0.0812 0.0350 4.4672 0.1970 0.2302 0.6223 13.7742 0.0610 3.1502 0.0917 2.2494 4.0767 24.6391 1.2291 0.5177 1.4089 9.8661 20.9695 0.1174 20.3863 0.1042 12.1645 0.0005 2.9229 0.0603 9.8284 0.3096 0.8929 0.1119 4.6870 0.0141 18.7656 13.0687 3.7782 7.0426 30.1122 36.7916 11.5107 4.0675 0.0239 0.2206 1.6823 1.7614 1.9011 12.5602 12.1798 3.2743 26.6041 295.2775 111.0510 3.0612 163.8941 50.1687 0.0941 0.4848 4.9268 27.0678 1.7068 2.6665 217.7262 37.3030 0.0634 0.3385 1.4381 4.7527 2.8840 191.9791 99.0802 53.9461 16.9233 12.4298 11.4609 4.2777 37.1894
temp: 298.150 k
press: 1.00000 atm
elementType: 17 7 6 6 6 6 6 6 6 6 6 6 6 6 6 6 1 1 1 1 1 1 1 1 1 1 1 1 1 1 1 1 1 1 1 1 1 1
symmnumber: 1
zpe: 861419.8 jmol-1
zpe.correction: 0.328097 hartree
zpe.thermalcorrener: 0.346731 hartree
zpe.thermalcorrenthalpy: 0.347675 hartree
zpe.thermalcorrgfe: 0.278362 hartree
zpe.sumelectzpe: -1060.255047 hartree
zpe.sumelectthermal: -1060.236414 hartree
zpe.sumelectthermalent: -1060.235470 hartree
zpe.sumelectthermalfe: -1060.304783 hartree
dipole: 5.1999 1.1734 -0.0022
dipole: 5.3307
quadrupole: -135.9853 -98.4395 -109.4709
quadrupole: -5.0977 0.0045 -0.0447
quadrupole: -21.3534 16.1924 5.1610 -5.0977 0.0045 -0.0447
hfenergy: -1060.583145 hartree
pointgroup: C01 [X(C14H22Cl1N1)]
dipole: -2.0378451 -0.4955814 -0.0040196 debye
polarizability: 265.1881328|9.7623442|152.0269504|-0.1705052|0.5037207|102.0006014 unknown
InChI: InChI=1S/C14H22ClN/c1-2-3-4-5-6-7-12-16-14-10-8-13(15)9-11-14/h8-11,16H,2-7,12H2,1H3
charge 0 multiplicity 1
38 atoms
Cl 7.296382 0.830273 -0.002727
N  1.462931 -0.805403 -0.002677
C  -3.576628 -0.447144 -0.001143
C  -2.228534 0.308084 0.005282
C  -4.801883 0.494469 0.00495
C  -1.007256 -0.63719 -0.00136
C  -6.151523 -0.258319 -0.001045
C  0.331643 0.125982 0.00468
C  -7.376903 0.68403 0.004528
C  -8.721532 -0.07495 -0.001586
C  2.799798 -0.413158 -0.003071
C  3.176974 0.964086 0.011118
C  3.835377 -1.398155 -0.016832
C  4.538166 1.337341 0.011228
C  5.192606 -1.025989 -0.016682
C  5.531978 0.342553 -0.002679
H  -3.624911 -1.104688 -0.894279
H  -3.626058 -1.117737 0.882171
H  -2.181029 0.978062 -0.878086
H  -2.181857 0.964437 0.898869
H  -4.754283 1.152813 0.897689
H  -4.753444 1.165378 -0.878332
H  -1.052405 -1.289514 -0.897967
H  -1.052852 -1.302696 0.885434
H  -6.202663 -0.928923 0.882391
H  -6.201504 -0.916875 -0.893571
H  0.377167 0.79493 -0.882766
H  0.37705 0.780642 0.902665
H  -7.326223 1.341737 0.89636
H  -7.325008 1.353816 -0.87819
H  1.253549 -1.802931 -0.015255
H  -9.580336 0.621273 0.002496
H  -8.810668 -0.716219 -0.898896
H  -8.811975 -0.728309 0.886823
H  2.413622 1.747321 0.022459
H  3.571723 -2.463114 -0.027793
H  4.816916 2.395455 0.022245
H  5.975087 -1.790765 -0.027354
