program: Gaussian 09
title: 000224557
version: EM64L-G09RevD.01
frameworkgroup: C1[X(C18H26N2O2)]
method: RPBEPBE
basis: SDD
operation: Freq
keyword: #p
keyword: freq=noraman
keyword: PBEPBE/SDD
title: #p freq=noraman PBEPBE/SDD
converged: YES YES NO NO
title: Mulliken charges:
elementType: O O N N C C C C C C C C C C C C C C C C C C H H H H H H H H H H H H H H H H H H H H H H H H H H
charge: -0.474828 -0.270358 -0.193848 -0.019999 -0.448455 -0.318134 -0.180155 -0.362418 -0.331109 0.385306 -0.338561 0.273851 -0.674306 -0.344131 -0.075401 -0.693009 -0.546459 -0.383061 -0.314457 0.302830 -0.358908 -0.536991 0.239233 0.233330 0.206061 0.197764 0.203551 0.208901 0.185761 0.213147 0.203423 0.195611 0.192404 0.215017 0.222715 0.224602 0.283724 0.360228 0.217954 0.215478 0.209347 0.246928 0.234016 0.258455 0.245048 0.244990 0.223362 0.221550
chargesum: 0.00000
title: Mulliken charges with hydrogens summed into heavy atoms:
elementType: O O N N C C C C C C C C C C C C C C C C C C
charge: -0.114600 -0.270358 -0.193848 -0.019999 0.024108 0.085691 0.023396 0.032243 0.085461 0.385306 0.049454 0.273851 -0.011971 -0.060407 -0.075401 -0.050230 -0.299530 -0.149046 -0.056002 0.302830 -0.113860 0.152912
chargesum: -0.00006
polarizability: 2.69475299e+02 1.45869349e+01 2.67391105e+02 6.11216476e+00 1.80030639e+01 1.45402735e+02
1716.lowfreq: -7.0984 -3.4544 -3.0979 -0.0121 -0.0006 3.8192 17.5256 23.5613 31.6848
frequency: 17.3343 23.4061 31.5236 53.8615 56.9891 66.6180 71.5457 81.0612 104.9453 111.9411 137.5205 153.6122 179.2613 187.5209 203.5954 226.2732 235.2685 238.3965 251.4690 283.5345 299.8152 303.7092 327.8736 349.9181 372.3304 383.4232 425.5301 441.5524 471.8735 490.7730 501.3425 538.7204 550.7910 555.7155 587.0227 623.9469 676.3242 692.3649 732.0590 734.2871 764.4757 776.2180 785.3186 796.0507 808.4640 828.6808 834.8430 868.6754 872.5517 881.6404 893.3503 899.7261 927.3744 949.9577 965.9345 979.2485 989.9633 1004.0947 1007.8560 1029.5011 1056.3749 1065.0550 1075.2401 1078.9985 1084.9086 1097.2568 1111.7503 1116.5020 1133.9982 1156.1958 1159.3128 1185.2529 1192.5468 1224.0225 1229.9687 1238.9521 1245.4224 1256.3057 1266.9067 1275.8293 1278.1651 1289.5450 1295.7351 1305.0864 1338.7665 1343.2028 1345.6594 1359.8122 1364.1443 1371.3845 1387.2738 1390.1951 1392.4699 1399.4811 1425.9935 1436.8168 1453.3465 1459.7053 1465.1040 1468.8865 1470.0141 1473.5903 1474.5470 1475.6712 1477.6260 1479.9891 1486.0470 1489.3126 1507.5462 1549.1169 1585.0527 1630.5427 2893.1109 2903.2869 2915.1802 2957.5742 2961.5002 2964.8199 2974.8973 2976.4644 2986.6063 3005.5749 3017.0276 3039.3858 3046.1348 3050.3706 3069.7114 3071.9366 3075.0654 3082.4124 3090.7779 3123.3791 3124.5078 3124.9920 3149.9511 3159.8804 3171.8558 3178.9936
redmass: 4.2488 4.2511 2.7036 2.5454 2.6306 2.3821 3.2086 3.6601 2.3700 4.5694 2.6074 3.3721 3.7371 2.5023 2.3238 1.4392 1.2028 1.9663 2.1473 2.6226 3.5318 3.7768 3.7816 3.7633 3.8899 2.9178 4.1045 3.8054 2.5913 2.8790 4.6431 3.7789 4.9174 4.0446 3.5917 5.3147 3.8169 5.9518 1.1290 3.3456 1.1347 1.9609 1.7105 1.1798 2.0260 1.8999 3.1372 3.4469 2.2273 1.3131 3.3811 1.7998 1.4160 1.8361 1.3453 1.4397 4.6135 3.2459 3.2129 2.9347 2.6570 2.9210 2.6192 2.3172 1.6594 2.3397 1.2567 2.2045 1.3823 1.6493 1.3256 2.0845 2.1022 1.7894 1.8522 1.4561 1.7838 2.1317 1.3077 1.2869 1.1510 1.0824 1.2518 1.6994 1.6039 1.3212 1.5074 1.9953 1.3476 1.4949 3.5272 1.2291 1.2376 1.5694 2.5084 1.4483 1.1009 2.4842 1.0825 1.0522 1.0731 1.0533 1.0943 1.0501 1.0436 1.0668 1.0798 1.0872 4.0354 6.8596 7.1133 7.0337 1.0692 1.0709 1.0821 1.0671 1.0329 1.0587 1.0405 1.0561 1.0358 1.0965 1.0925 1.0913 1.1010 1.1041 1.0950 1.1004 1.0997 1.0984 1.1004 1.0880 1.0948 1.0699 1.0871 1.0904 1.0971 1.0936
irintensity: 0.2390 0.0997 0.1933 0.2421 0.4507 0.4047 1.4912 5.8946 0.1813 0.7419 1.3282 2.6572 2.4012 0.4053 3.6331 0.8938 0.3361 3.0740 0.3769 2.3481 8.7660 4.0853 1.6527 1.1692 0.7247 4.7399 1.1890 2.4639 6.0608 1.8304 2.3811 3.5785 8.0645 7.9585 3.9452 14.4875 2.2112 14.9294 13.0284 4.9771 70.8719 5.4426 11.6375 5.0549 7.2939 26.6231 8.3097 6.8946 2.5755 67.3879 1.7786 9.0746 6.5428 4.0805 2.2754 2.3611 45.3899 40.7307 25.1170 8.0809 19.0863 81.2048 6.3098 5.5614 21.0452 14.6186 0.1386 7.6245 3.9122 18.2881 9.3530 148.1506 31.7291 16.2348 8.2050 8.8561 92.0266 29.0247 9.6256 4.0287 8.8495 3.6487 11.6091 20.1516 9.5942 15.2659 0.9005 27.2660 3.3012 6.7669 15.3075 9.0487 17.6727 48.6125 3.4584 11.3167 4.1312 39.3131 2.6833 13.8088 2.2105 9.7730 30.5640 14.6690 12.9569 4.7576 12.0549 17.3546 91.2314 29.0137 22.1516 93.1536 35.6066 110.6277 35.5427 47.6032 83.6748 18.0064 27.6539 57.7821 21.9239 6.7569 6.4888 11.2942 52.4541 46.8510 14.5123 80.0530 53.1145 57.6702 36.3643 77.3539 29.0850 232.4486 3.6988 9.4407 13.8993 3.1144
temp: 298.150 k
press: 1.00000 atm
elementType: 8 8 7 7 6 6 6 6 6 6 6 6 6 6 6 6 6 6 6 6 6 6 1 1 1 1 1 1 1 1 1 1 1 1 1 1 1 1 1 1 1 1 1 1 1 1 1 1
symmnumber: 1
zpe: 1068713.8 jmol-1
zpe.correction: 0.407052 hartree
zpe.thermalcorrener: 0.430108 hartree
zpe.thermalcorrenthalpy: 0.431053 hartree
zpe.thermalcorrgfe: 0.352322 hartree
zpe.sumelectzpe: -959.759004 hartree
zpe.sumelectthermal: -959.735947 hartree
zpe.sumelectthermalent: -959.735003 hartree
zpe.sumelectthermalfe: -959.813734 hartree
dipole: -2.2207 3.9930 3.1283
dipole: 5.5373
quadrupole: -120.4250 -127.0293 -137.1490
quadrupole: 16.8190 -0.6447 -2.7133
quadrupole: 7.7761 1.1718 -8.9479 16.8190 -0.6447 -2.7133
hfenergy: -960.1660554 hartree
pointgroup: C01[X(C18H26N2O2)]
dipole: -0.954976 1.5518962 1.1940401 debye
polarizability: 268.0853539|14.4914291|269.1717803|6.7237553|16.4815581|145.0120042 unknown
InChI: InChI=1S/C18H26N2O2/c1-4-6-11-20(5-2)13-18(21)15-9-10-19-17-8-7-14(22-3)12-16(15)17/h7-10,12,18,21H,4-6,11,13H2,1-3H3
charge 0 multiplicity 1
48 atoms
O  -1.431353 -1.753776 -1.225482
O  2.514718 3.321811 0.414075
N  -2.67582 -0.531296 0.759712
N  3.567564 -2.156483 -0.397434
C  -1.190683 -0.522263 0.859163
C  -3.244218 0.802339 0.399268
C  -0.59994 -0.745336 -0.581397
C  -4.572092 0.708857 -0.380707
C  -3.354723 -1.172949 1.92487
C  0.848959 -1.199157 -0.537031
C  -5.138227 2.101152 -0.744321
C  1.923698 -0.27396 -0.252336
C  -3.23634 -2.708034 1.91769
C  1.172297 -2.540857 -0.756014
C  3.272082 -0.813117 -0.191905
C  -6.460058 2.015914 -1.537327
C  1.733716 1.125188 -0.040006
C  2.533276 -2.973459 -0.674646
C  4.360112 0.07012 0.086828
C  2.824414 1.963786 0.227562
C  4.154728 1.434801 0.295796
C  3.619729 4.24812 0.674178
H  -0.875074 -1.36983 1.491222
H  -0.795141 0.410436 1.313918
H  -2.502435 1.324551 -0.235105
H  -3.383055 1.43223 1.31086
H  -0.668934 0.210022 -1.149024
H  -4.400768 0.119338 -1.302755
H  -5.32835 0.155836 0.212346
H  -4.423481 -0.896907 1.87745
H  -2.961669 -0.763084 2.88546
H  -4.386022 2.658659 -1.339052
H  -5.299036 2.687534 0.183631
H  -3.759559 -3.134094 2.793445
H  -2.184716 -3.042987 1.960155
H  -3.687181 -3.127323 1.001121
H  0.372466 -3.242604 -1.004993
H  -2.324876 -1.612682 -0.761114
H  -6.845767 3.02094 -1.788114
H  -6.318773 1.461821 -2.483986
H  -7.239921 1.4905 -0.954378
H  0.741157 1.581458 -0.095643
H  2.783045 -4.027832 -0.844324
H  5.362033 -0.368228 0.125892
H  5.007703 2.087426 0.503852
H  3.14526 5.235155 0.77667
H  4.338208 4.266856 -0.168039
H  4.151049 3.992408 1.611468
