program: Gaussian 09
title: 000224530
version: EM64L-G09RevD.01
frameworkgroup: C1[X(C17H24N2O)]
method: RPBEPBE
basis: SDD
operation: Freq
keyword: #p
keyword: freq=noraman
keyword: PBEPBE/SDD
title: #p freq=noraman PBEPBE/SDD
converged: YES YES NO NO
title: Mulliken charges:
elementType: O N N C C C C C C C C C C C C C C C C C H H H H H H H H H H H H H H H H H H H H H H H H
charge: -0.439540 -0.123036 -0.061088 -0.370393 -0.320882 -0.295383 -0.290448 -0.386856 -0.361135 0.200315 -0.667735 -0.690954 -0.292684 -0.107530 0.442782 -0.329715 -0.333721 -0.395700 -0.224586 -0.250743 0.211408 0.215725 0.183257 0.210570 0.175619 0.197235 0.240218 0.190535 0.200416 0.212946 0.190760 0.220516 0.233050 0.199787 0.209074 0.208304 0.219032 0.234676 0.344499 0.242389 0.263619 0.234363 0.231584 0.229446
chargesum: 0.00000
title: Mulliken charges with hydrogens summed into heavy atoms:
elementType: O N N C C C C C C C C C C C C C C C C C
charge: -0.095041 -0.123036 -0.061088 0.056740 0.072945 0.077472 -0.050230 0.004096 0.042571 0.200315 -0.014382 -0.054544 -0.058008 -0.107530 0.442782 -0.087326 -0.070101 -0.161337 0.006999 -0.021297
polarizability: 2.62604916e+02 -4.07784687e+01 1.63521588e+02 6.09327610e+00 4.07860850e+00 1.89098393e+02
1716.lowfreq: -9.5277 -4.9139 -0.0008 -0.0006 0.0003 6.4392 7.8417 17.8164 33.6073
frequency: 5.8834 17.3417 33.5774 51.0865 61.1432 68.4926 86.8352 121.0328 127.2628 151.0902 174.1532 196.4312 200.5485 212.7949 222.8220 268.8323 282.7304 296.0889 317.5552 337.2893 368.9051 383.9339 395.4480 406.7030 434.6925 478.2935 485.2164 517.1617 535.7726 570.3397 588.1090 611.4115 684.0967 709.2417 743.3747 749.7738 753.9498 767.2182 802.4966 820.4661 842.3017 857.6565 862.7494 874.0540 887.3688 905.3041 914.5434 927.8835 960.5528 964.0003 980.6849 985.2302 996.1228 1015.9674 1018.1064 1035.7767 1051.6453 1088.1568 1091.4957 1097.3022 1111.0613 1122.1807 1146.7398 1152.7538 1166.0719 1195.8968 1214.5163 1230.2546 1238.7736 1241.2719 1255.3534 1265.1625 1267.2524 1269.2419 1287.0315 1298.0025 1311.6636 1320.8545 1340.8247 1346.1182 1367.7788 1372.9677 1377.8187 1385.3409 1388.2896 1391.0668 1405.0404 1423.6113 1460.3143 1461.0429 1462.0220 1471.6300 1473.2848 1475.4415 1477.7643 1479.7662 1488.4419 1491.4631 1505.8362 1553.1986 1596.1388 1624.1632 2834.7202 2844.1304 2870.4979 2972.8295 2976.6119 2982.5126 2983.5740 3001.5817 3016.7648 3027.5951 3040.1299 3046.1359 3053.3149 3071.3609 3074.9713 3075.2298 3086.9791 3119.9704 3127.4438 3135.9943 3153.1541 3168.0782 3168.7916 3561.0946
redmass: 3.8868 4.1352 4.2686 2.7753 1.6231 3.2663 4.3833 2.0983 4.2134 4.9163 4.1809 2.2039 1.3576 4.2138 1.1124 2.4955 2.8478 2.6388 2.6105 1.1549 3.7087 3.7253 3.0941 2.8871 3.6890 3.1821 3.0879 7.0517 2.8751 4.0817 4.1301 7.1621 3.2715 3.0384 1.4562 1.2593 4.1501 1.3880 3.0379 2.0502 1.5476 4.1652 2.0539 1.3498 1.7109 1.6485 1.5717 4.6848 4.5627 1.3620 1.8584 1.3853 1.3312 2.4423 2.2259 1.7888 2.7022 2.0202 2.3462 1.9431 1.7888 2.0970 1.2675 1.4660 1.1073 2.3321 1.7576 1.6330 1.9262 1.4006 1.3080 1.3249 1.3707 1.5775 1.3470 1.7218 1.4377 1.8448 1.4212 1.4477 1.3641 1.3958 2.2875 1.3990 1.2515 1.2319 5.4858 2.1632 1.0831 2.7845 1.0746 1.0703 1.0702 1.0919 1.0426 1.0666 1.0729 1.0682 3.5966 7.2474 6.4152 6.6585 1.0718 1.0716 1.0710 1.0356 1.0535 1.0425 1.0611 1.0850 1.0965 1.0908 1.0907 1.0937 1.0874 1.1010 1.0997 1.0992 1.0997 1.0872 1.0896 1.0889 1.0946 1.0983 1.0975 1.0663
irintensity: 0.1914 0.7612 0.9511 0.0177 0.1839 0.1026 0.9037 0.3412 0.8442 2.8451 8.6617 0.3765 0.1841 3.0197 0.2110 0.6051 1.0319 2.5947 2.0025 176.2141 0.5932 5.5900 4.7965 2.9413 8.0747 3.6499 17.6607 0.3034 3.6904 2.1119 3.7593 3.3126 3.0284 8.7469 5.4412 15.7015 1.1970 55.3358 0.2706 18.5250 83.8219 0.1688 4.2041 2.1033 3.1823 0.9137 2.3406 4.3578 99.9792 2.0217 8.8387 5.6853 0.0767 6.8286 25.9421 18.6592 1.0655 11.3566 3.7703 14.3050 8.7212 10.0332 1.0821 17.1943 1.8601 6.0346 8.5490 12.4465 2.4039 30.4268 5.3997 3.1427 3.5284 6.0273 5.8446 6.8568 1.6186 14.5967 2.6416 22.4683 2.4828 0.5660 0.5305 2.7655 14.6253 12.6574 1.4895 9.1930 1.0903 2.1515 3.3860 3.3292 13.7090 6.4845 11.7303 0.8637 7.2811 30.0632 23.8347 10.8084 15.9027 5.1767 39.8376 154.2373 178.4864 48.5859 60.4426 17.0336 34.7562 24.4818 13.1321 7.5757 28.8110 21.0574 26.2822 72.0000 55.6710 60.4176 36.5939 2.9429 8.4800 11.4139 25.4700 35.5396 2.5413 10.8683
temp: 298.150 k
press: 1.00000 atm
elementType: 8 7 7 6 6 6 6 6 6 6 6 6 6 6 6 6 6 6 6 6 1 1 1 1 1 1 1 1 1 1 1 1 1 1 1 1 1 1 1 1 1 1 1 1
symmnumber: 1
zpe: 985145.2 jmol-1
zpe.correction: 0.375222 hartree
zpe.thermalcorrener: 0.395874 hartree
zpe.thermalcorrenthalpy: 0.396819 hartree
zpe.thermalcorrgfe: 0.322610 hartree
zpe.sumelectzpe: -845.401416 hartree
zpe.sumelectthermal: -845.380763 hartree
zpe.sumelectthermalent: -845.379819 hartree
zpe.sumelectthermalfe: -845.454027 hartree
dipole: 0.7225 -0.7080 1.1260
dipole: 1.5136
quadrupole: -111.0530 -124.6875 -113.4497
quadrupole: 0.7266 2.1794 1.7108
quadrupole: 5.3437 -8.2907 2.9470 0.7266 2.1794 1.7108
hfenergy: -845.7766376 hartree
pointgroup: C01 [X(C17H24N2O1)]
dipole: -0.2950043 0.1484082 0.495538 debye
polarizability: 259.9436525|-41.2230842|171.9522828|-15.7440333|-11.1784214|183.3289607 unknown
InChI: InChI=1S/C17H24N2O/c1-3-11-19(12-4-2)13-17(20)16-10-9-14-7-5-6-8-15(14)18-16/h5-10,17,20H,3-4,11-13H2,1-2H3
charge 0 multiplicity 1
44 atoms
O  1.046387 -2.691957 -2.091552
N  2.519928 0.286298 -0.389684
N  -1.115381 -0.147092 -1.277793
C  2.402277 -0.997658 -1.11631
C  2.428188 1.470477 -1.289032
C  3.719643 0.308022 0.488081
C  1.007854 -1.252941 -1.72806
C  2.112327 2.79367 -0.552347
C  3.549201 -0.505071 1.790989
C  -0.156848 -0.9632 -0.791318
C  0.779856 2.750325 0.224401
C  4.798935 -0.413368 2.692971
C  -0.23761 -1.577083 0.505716
C  -2.223107 0.120797 -0.479178
C  -2.380125 -0.450097 0.842668
C  -1.34021 -1.319745 1.314725
C  -3.237333 0.990946 -0.989618
C  -3.546157 -0.12977 1.608332
C  -4.365837 1.288271 -0.219632
C  -4.521865 0.724982 1.087155
H  3.154624 -1.095418 -1.938891
H  2.599367 -1.823521 -0.410171
H  3.365545 1.595092 -1.891996
H  1.608122 1.284662 -2.00655
H  4.630105 -0.054486 -0.057625
H  3.921805 1.357908 0.767057
H  0.844945 -0.640205 -2.636116
H  2.938535 3.058408 0.13688
H  2.081879 3.599373 -1.313612
H  2.65745 -0.123629 2.323776
H  3.34779 -1.568785 1.55607
H  -0.070694 2.577875 -0.460442
H  0.789534 1.920065 0.952191
H  0.600576 3.6972 0.766562
H  5.696137 -0.800695 2.173632
H  5.00558 0.634326 2.982992
H  4.667334 -0.999569 3.620453
H  0.568767 -2.239765 0.83172
H  0.221398 -2.908081 -2.596294
H  -1.426739 -1.771293 2.310202
H  -3.094628 1.407678 -1.991604
H  -3.663294 -0.562408 2.609547
H  -5.138833 1.956858 -0.614333
H  -5.412227 0.968604 1.677242
