program: Gaussian 09
title: 000224520
version: EM64L-G09RevD.01
frameworkgroup: C1[X(C20H31N3O2)]
method: RPBEPBE
basis: SDD
operation: Freq
keyword: #p
keyword: freq=noraman
keyword: PBEPBE/SDD
title: #p freq=noraman PBEPBE/SDD
converged: YES YES NO NO
title: Mulliken charges:
elementType: O O N N N C C C C C C C C C C C C C C C C C C C C H H H H H H H H H H H H H H H H H H H H H H H H H H H H H H H
charge: -0.284935 -0.271543 -0.284280 -0.404897 -0.055201 -0.368240 -0.359443 -0.387457 -0.447672 -0.376968 -0.355591 -0.052139 0.387960 -0.284436 -0.701575 -0.688590 0.454422 -0.560652 -0.045596 0.254085 -0.330351 -0.185204 -0.388649 -0.521349 -0.533153 0.189361 0.190815 0.191769 0.193280 0.179687 0.215923 0.207984 0.214679 0.176293 0.204002 0.205369 0.205033 0.232178 0.202846 0.338456 0.205081 0.237757 0.195875 0.212494 0.224758 0.199459 0.257670 0.276697 0.223918 0.236822 0.224779 0.207740 0.254205 0.225955 0.217790 0.242782
chargesum: 0.00000
title: Mulliken charges with hydrogens summed into heavy atoms:
elementType: O O N N N C C C C C C C C C C C C C C C C C C C C
charge: -0.284935 -0.271543 -0.052103 -0.066440 -0.055201 0.011936 0.025606 0.008152 -0.025009 0.003327 0.054810 0.150707 0.387960 -0.284436 -0.062862 -0.051878 0.454422 -0.302983 -0.045596 0.254085 -0.053655 0.038714 -0.151827 0.165375 0.153374
polarizability: 3.52001141e+02 -7.53827254e+00 2.99424546e+02 -5.26557206e+00 -1.25867503e+00 1.51227173e+02
1716.lowfreq: -26.0857 -2.4542 -0.0014 0.0010 0.0017 1.2916 11.1374 13.4579 19.4909
frequency: -23.0935 12.9487 19.2709 33.4971 44.0058 54.4029 60.1676 74.2007 82.4925 97.4337 100.7379 116.1220 122.4809 127.4760 135.6300 141.9836 154.0646 168.7239 189.1467 198.7655 205.6712 210.0649 225.3849 244.1504 255.2334 277.5273 287.7933 301.0763 326.5138 350.3473 373.6889 408.0536 422.6804 438.4564 440.2319 459.9897 470.8211 486.8040 499.3616 539.5404 594.5401 597.5310 627.9313 643.3730 645.6159 668.9932 683.5490 712.0601 724.7093 748.3735 785.9574 799.0999 815.7261 825.0402 833.0094 857.4731 884.4875 885.8384 906.7985 921.6039 928.4007 936.6048 941.0749 982.9923 995.0087 1002.2204 1014.4258 1017.6401 1040.9694 1052.8278 1072.6941 1077.9197 1080.6973 1091.3967 1105.4093 1110.2709 1110.8040 1120.4616 1130.1146 1146.2763 1151.3918 1156.1108 1158.4107 1174.5455 1180.7850 1201.2168 1221.9936 1222.5434 1231.7358 1234.9142 1264.6709 1268.8086 1279.0352 1290.0025 1290.7916 1296.1981 1308.1970 1320.2186 1335.1107 1352.7316 1357.5780 1363.8830 1366.5210 1375.5666 1380.2981 1385.8186 1397.4702 1416.3701 1423.8616 1439.3211 1444.0465 1447.7156 1455.5422 1461.2123 1462.6749 1463.2775 1463.5892 1466.8350 1470.1076 1472.1023 1478.4495 1480.0737 1481.2627 1483.3749 1484.4279 1492.1613 1499.1419 1521.4159 1574.2612 1586.8009 1620.5371 2854.5127 2909.0702 2944.3366 2953.0573 2955.6246 2960.8452 2961.5891 2965.6503 2965.6735 2970.3930 2970.6669 2975.1498 2991.2325 2991.8010 3010.9351 3034.5682 3046.7588 3050.2849 3059.5014 3069.5695 3070.1749 3070.4141 3093.9516 3114.6627 3120.6814 3124.5833 3151.0634 3171.8362 3173.9919 3413.4829 3481.2836
redmass: 2.0614 4.3050 4.5503 3.9630 1.8555 3.8001 3.6347 3.4151 2.8659 1.7674 3.4075 4.1127 4.0358 2.1567 3.1674 2.5459 2.2747 1.4272 3.5078 3.7001 1.0669 1.8427 2.7386 2.7137 1.2388 2.3921 3.8070 3.6484 3.7739 3.9456 2.9657 3.6122 3.9749 3.0968 3.4025 4.6435 4.5345 3.1675 2.9629 4.2366 4.8582 1.2532 5.1165 1.5672 2.4875 6.6957 5.8309 5.0288 1.0711 1.1085 1.6570 1.2347 1.4606 2.2008 4.5735 4.6612 1.2670 7.6310 1.2389 1.7155 1.4541 1.5231 7.9584 1.2162 1.3428 4.6394 4.0885 5.1357 3.6009 3.1427 2.6106 2.5659 2.0099 2.3066 2.9405 1.2619 1.2610 2.4540 2.1721 1.4497 1.4350 1.6238 1.5213 2.0353 2.2165 1.9008 1.5737 1.6719 1.8770 1.5482 1.2411 1.3548 1.1106 1.2932 1.1435 1.5383 1.4908 1.3708 1.3977 1.5788 2.2378 1.3096 1.7759 1.8635 1.3845 1.2273 2.5655 3.2966 1.2308 2.3160 1.1722 1.3666 1.1830 1.0687 1.0667 1.0490 1.0643 1.0585 1.2438 1.6206 1.3270 1.0803 1.1035 1.0786 1.0552 1.0891 1.1201 3.5079 5.6249 6.5803 7.0844 1.0699 1.0573 1.1016 1.0591 1.0615 1.0328 1.0620 1.0341 1.0355 1.0697 1.0594 1.0504 1.0965 1.0850 1.1013 1.1031 1.1038 1.1039 1.0987 1.0980 1.0988 1.0986 1.1000 1.1038 1.0997 1.0886 1.0908 1.0895 1.0982 1.0736 1.0764
irintensity: 0.3505 0.0355 0.1862 0.3014 0.2449 0.2269 1.2576 6.2251 4.0299 2.1517 2.7833 0.1670 0.0060 0.7085 3.6468 0.7603 2.4655 0.7837 0.8553 2.8300 0.2043 1.8576 1.1163 5.1527 0.9865 1.2712 4.5008 3.5092 1.1317 1.8821 2.7270 7.8934 1.3559 0.7192 2.7458 10.2585 0.9829 5.5193 5.5352 0.1678 10.5399 57.3791 11.1842 91.8538 20.5883 5.5121 4.6413 11.1026 12.6009 0.7849 47.8994 4.6321 13.2470 7.0903 13.1371 28.1003 2.0801 15.4921 4.3895 0.4821 1.2691 1.2625 36.4383 1.9135 1.0603 0.1854 6.8612 66.4965 40.0646 7.3899 0.8468 40.0109 0.1274 40.3573 24.1632 5.3060 11.0654 43.7740 18.9229 7.4043 1.1898 25.8523 3.0307 46.1108 37.6928 33.3492 41.7670 128.9214 8.2017 1.6083 1.0521 1.3956 0.0867 2.7915 0.3221 11.1447 3.3434 8.3453 3.7350 19.1669 47.7087 17.6188 17.6106 2.1612 5.1440 27.0301 6.6920 202.0653 6.2856 2.0292 25.7813 50.0869 7.1528 0.7027 0.1577 5.2554 2.8768 17.2391 61.0897 87.3492 40.3009 5.8786 14.1027 7.6248 13.9740 7.0580 67.7983 182.5063 175.8769 74.8159 243.0302 90.4335 71.0588 33.1695 0.9017 0.8896 70.9316 38.6723 87.4727 31.8278 11.7911 86.4590 40.6793 4.5617 34.9398 0.0738 2.7006 162.6111 50.3945 6.7347 72.2422 73.6684 40.9455 36.6384 24.4291 27.5985 14.9187 20.6867 16.9081 17.6007 2.6116 52.1789
temp: 298.150 k
press: 1.00000 atm
elementType: 8 8 7 7 7 6 6 6 6 6 6 6 6 6 6 6 6 6 6 6 6 6 6 6 6 1 1 1 1 1 1 1 1 1 1 1 1 1 1 1 1 1 1 1 1 1 1 1 1 1 1 1 1 1 1 1
symmnumber: 1
zpe: 1256433.7 jmol-1
zpe.correction: 0.478550 hartree
zpe.thermalcorrener: 0.505705 hartree
zpe.thermalcorrenthalpy: 0.506649 hartree
zpe.thermalcorrgfe: 0.418309 hartree
zpe.sumelectzpe: -1093.467590 hartree
zpe.sumelectthermal: -1093.440435 hartree
zpe.sumelectthermalent: -1093.439491 hartree
zpe.sumelectthermalfe: -1093.527832 hartree
dipole: 2.7672 -1.4393 1.8835
dipole: 3.6437
quadrupole: -152.4893 -138.7520 -154.4603
quadrupole: 6.8112 -4.9657 -2.9645
quadrupole: -3.9221 9.8152 -5.8931 6.8112 -4.9657 -2.9645
hfenergy: -1093.9461405 hartree
pointgroup: C01 [X(C20H31N3O2)]
dipole: -1.115408 0.6886779 0.5801671 debye
polarizability: 351.85315|-4.396414|292.9417471|11.3515813|-29.7554662|157.8579626 unknown
InChI: InChI=1S/C20H31N3O2/c1-15(2)21-11-7-5-6-8-12-22-17-14-18(24-3)20(25-4)16-10-9-13-23-19(16)17/h9-10,13-15,21-22H,5-8,11-12H2,1-4H3
charge 0 multiplicity 1
56 atoms
O  6.267274 0.904171 -0.135779
O  4.280913 2.849821 -0.575306
N  -7.995253 0.459405 -0.160624
N  0.799643 -0.59102 0.159838
N  2.737506 -2.434219 0.6008
C  -4.245427 -0.501266 -0.036009
C  -2.935467 0.317857 -0.061983
C  -5.510096 0.382975 -0.108754
C  -1.671281 -0.561191 0.055098
C  -6.818425 -0.433897 -0.11064
C  -0.370392 0.260929 -0.030394
C  -9.320398 -0.179788 -0.371188
C  2.106786 -0.156487 0.093485
C  3.145104 -1.1421 0.330789
C  -10.373069 0.925684 -0.593196
C  -9.758722 -1.143864 0.768549
C  4.533137 -0.7466 0.282678
C  2.484818 1.171992 -0.191449
C  4.890486 0.606764 -0.011738
C  3.862368 1.543348 -0.25854
C  5.506707 -1.771813 0.527042
C  5.083896 -3.075047 0.80103
C  3.683668 -3.367675 0.828571
C  6.789245 1.960182 0.756233
C  3.259227 3.830559 -0.945151
H  -4.274993 -1.116144 0.887863
H  -4.246779 -1.215478 -0.885655
H  -2.949047 1.054541 0.768079
H  -2.892716 0.906109 -1.00211
H  -5.517037 1.081239 0.755607
H  -5.488292 1.011686 -1.019886
H  -1.692558 -1.109965 1.019012
H  -1.672248 -1.324333 -0.749147
H  -6.812053 -1.124303 0.770884
H  -6.847137 -1.077939 -1.01301
H  -0.321552 0.766745 -1.020631
H  -0.392466 1.067741 0.737415
H  -8.016084 1.104933 0.643325
H  -9.234042 -0.771097 -1.306481
H  0.695743 -1.587284 0.380837
H  -11.365847 0.492091 -0.811331
H  -10.073614 1.575683 -1.433171
H  -10.473228 1.556923 0.312106
H  -10.718371 -1.636826 0.523546
H  -9.006613 -1.935588 0.940051
H  -9.894316 -0.586097 1.715894
H  1.711775 1.922534 -0.370538
H  6.56644 -1.50446 0.485028
H  5.80659 -3.875029 0.991192
H  3.3295 -4.383437 1.039248
H  7.872636 1.993998 0.560656
H  6.605061 1.701699 1.817865
H  6.32537 2.932811 0.520124
H  2.678915 3.493259 -1.825283
H  2.571475 4.040475 -0.102803
H  3.819637 4.742793 -1.198749
