program: Gaussian 09
title: 000224503
version: EM64L-G09RevD.01
frameworkgroup: C1[X(C14H18ClN3O)]
method: RPBEPBE
basis: SDD
operation: Freq
keyword: #p
keyword: freq=noraman
keyword: PBEPBE/SDD
title: #p freq=noraman PBEPBE/SDD
converged: YES YES NO NO
title: Mulliken charges:
elementType: Cl O N N N C C C C C C C C C C C C C C H H H H H H H H H H H H H H H H H H
charge: -0.049763 -0.451088 -0.393172 -0.068813 -0.056594 -0.357138 -0.449680 -0.372907 -0.322155 -0.364047 -0.340063 0.160676 0.217644 0.098633 -0.319296 -0.315634 -0.261566 -0.078547 -0.403059 0.200967 0.200963 0.206161 0.206112 0.188869 0.188901 0.239223 0.239388 0.215474 0.215457 0.315954 0.187161 0.187092 0.203193 0.287529 0.257540 0.342420 0.244166
chargesum: 0.00000
title: Mulliken charges with hydrogens summed into heavy atoms:
elementType: Cl O N N N C C C C C C C C C C C C C C
charge: -0.049763 -0.108668 -0.077219 -0.068813 -0.056594 0.044792 -0.037407 0.004863 0.156457 0.066883 0.034190 0.160676 0.217644 0.098633 -0.116104 -0.028105 -0.004026 -0.078547 -0.158893
polarizability: 2.95165892e+02 -1.97969314e+01 1.96334955e+02 -1.08844513e-01 -5.18313387e-02 9.73450857e+01
1716.lowfreq: -37.1595 -5.6163 -4.7486 0.0005 0.0014 0.0019 5.4224 18.5698 26.6574
frequency: -33.4516 18.3315 26.6543 43.0749 59.0899 83.5185 88.5325 108.4307 110.2118 135.0914 155.2536 167.5432 180.1960 229.1941 244.9697 279.2054 283.9091 305.5960 344.5293 381.3273 398.9174 430.8847 440.6637 481.1577 501.2616 519.8392 527.3864 570.7555 621.4294 652.5348 666.8623 729.3089 752.8884 755.3242 769.6138 800.2441 816.4412 848.2249 880.6703 882.6885 896.3504 936.4561 951.3038 961.1958 985.6379 989.0284 993.6343 1034.4403 1060.0846 1061.7324 1076.8025 1081.6371 1123.6083 1132.4158 1145.8943 1165.6972 1178.6151 1204.1662 1226.2099 1227.4023 1245.1447 1264.3552 1270.8371 1280.0158 1290.5327 1292.8063 1295.8910 1310.3057 1330.4766 1341.9099 1355.8695 1362.8087 1390.3039 1403.9469 1414.9772 1416.9531 1460.2973 1463.3055 1465.2704 1470.1026 1478.8750 1488.4579 1493.7434 1502.6733 1544.8506 1557.0277 1606.1299 2924.9296 2952.5030 2954.5401 2968.4791 2971.6801 2988.8215 2991.6110 2991.7002 3001.1111 3028.6510 3046.8751 3059.2306 3120.1840 3149.9179 3174.5973 3185.5636 3565.8799 3583.6893
redmass: 1.8286 5.3276 6.7147 3.3993 2.6620 2.8580 5.4880 5.3091 2.1462 2.4034 5.9217 2.8354 6.0497 6.2278 7.0335 1.0823 5.1868 6.3113 4.3715 6.6720 1.6783 4.0610 1.7665 3.7575 3.3211 4.4569 6.1608 9.2035 5.5151 7.1576 4.7574 1.0688 6.6137 1.1030 1.7678 1.1486 3.0428 7.4563 6.6779 1.2157 1.5174 1.3548 1.4506 7.9317 1.1723 5.1385 3.5738 4.0575 1.9450 2.9071 2.8377 2.1317 2.9570 3.0402 1.5651 1.2999 1.9484 1.3060 1.3251 1.8843 1.3238 1.1741 1.8288 1.0808 1.1112 1.5595 1.1055 2.8875 1.5296 2.3851 1.5481 1.6740 2.9728 2.4116 1.9393 1.4385 2.2354 1.1582 1.0740 1.0868 1.0889 1.0924 1.1147 6.3034 3.7679 7.5016 6.9516 1.0544 1.0587 1.0585 1.0591 1.1066 1.0588 1.0982 1.0590 1.1017 1.1047 1.1053 1.1048 1.0892 1.0917 1.0951 1.0936 1.0664 1.0770
irintensity: 0.6412 2.7173 0.1597 1.3024 4.1441 2.3230 0.9704 1.0515 1.7869 0.7952 2.3742 1.9088 3.4795 1.0506 0.5805 159.2214 0.5037 2.5557 13.4897 0.0326 26.3086 0.7972 56.6519 16.3649 5.2850 3.3466 1.5282 17.3953 0.6932 7.1552 19.7763 9.7610 2.8456 1.5795 38.3213 0.4184 11.0026 67.8951 25.1078 0.0298 17.8862 0.1796 12.9685 54.9498 0.3509 28.9927 17.7076 10.5873 25.0385 4.7897 0.4478 0.2284 20.6814 14.0425 0.2745 0.6173 13.9393 10.1951 0.0031 10.0097 32.3581 0.5408 2.9125 1.3960 0.4267 14.4216 0.6961 91.2881 45.9075 7.8801 58.2121 7.9131 60.2481 8.3810 8.1648 7.5552 51.3873 2.7889 0.4759 2.4258 11.3785 2.7609 47.9649 82.0019 105.0151 592.3555 140.4933 61.4710 5.0278 25.8982 49.4473 53.4795 27.2676 5.7990 51.7765 0.0020 6.3690 43.5879 127.0264 13.8329 27.3387 3.2160 0.8385 2.1595 43.9849
temp: 298.150 k
press: 1.00000 atm
elementType: 17 8 7 7 7 6 6 6 6 6 6 6 6 6 6 6 6 6 6 1 1 1 1 1 1 1 1 1 1 1 1 1 1 1 1 1 1
symmnumber: 1
zpe: 784642.0 jmol-1
zpe.correction: 0.298854 hartree
zpe.thermalcorrener: 0.317460 hartree
zpe.thermalcorrenthalpy: 0.318405 hartree
zpe.thermalcorrgfe: 0.249060 hartree
zpe.sumelectzpe: -1242.410938 hartree
zpe.sumelectthermal: -1242.392332 hartree
zpe.sumelectthermalent: -1242.391388 hartree
zpe.sumelectthermalfe: -1242.460732 hartree
dipole: -4.6594 -5.1715 0.0027
dipole: 6.9609
quadrupole: -135.6473 -119.8986 -122.5364
quadrupole: 13.0998 0.0144 -0.0093
quadrupole: -9.6198 6.1288 3.4911 13.0998 0.0144 -0.0093
hfenergy: -1242.7097923 hartree
pointgroup: C01 [X(C14H18Cl1N3O1)]
dipole: -1.9132078 -1.9593876 0.0234681 debye
polarizability: 293.4219384|-23.6882204|198.0624333|0.3264813|-1.291965|97.3615608 unknown
InChI: InChI=1S/C14H18ClN3O/c15-11-5-6-12-13(9-11)17-10-18-14(12)16-7-3-1-2-4-8-19/h5-6,9-10,16,19H,1-4,7-8H2
charge 0 multiplicity 1
37 atoms
Cl 6.587826 -2.060276 0.046556
O  -8.889437 -0.127194 0.011937
N  -0.090724 -0.05036 0.020907
N  1.057992 1.980943 -0.004066
N  3.501646 2.130362 -0.007415
C  -3.928033 0.32843 0.013206
C  -2.549868 -0.369397 0.021179
C  -5.110532 -0.665748 0.02095
C  -1.392238 0.645827 0.012201
C  -6.482258 0.045368 0.013825
C  -7.657573 -0.935336 0.020129
C  1.106954 0.617426 0.013004
C  2.383546 -0.093748 0.022372
C  3.566019 0.735417 0.010733
C  2.530269 -1.512577 0.042027
C  4.857091 0.121156 0.018122
C  3.798354 -2.107224 0.049437
C  4.94674 -1.26795 0.036989
C  2.259925 2.6510 -0.013009
H  -4.004457 0.98055 -0.880786
H  -4.006416 0.996893 0.894872
H  -2.47116 -1.033541 -0.864874
H  -2.472662 -1.016016 0.92025
H  -5.033851 -1.318614 0.915892
H  -5.032587 -1.333969 -0.862472
H  -1.450626 1.317102 0.890342
H  -1.448385 1.299155 -0.879487
H  -6.569723 0.692136 -0.880669
H  -6.571747 0.706221 0.897746
H  -0.096724 -1.069258 0.03114
H  -7.61058 -1.592845 -0.876274
H  -7.612929 -1.578626 0.926911
H  1.655323 -2.173631 0.052295
H  5.737547 0.767999 0.008855
H  3.912563 -3.194503 0.064548
H  -9.678247 -0.725881 0.019317
H  2.18436 3.74351 -0.026592
