program: Gaussian 09
title: 000224499
version: EM64L-G09RevD.01
frameworkgroup: C1[X(C12H18Cl2N2)]
method: RPBEPBE
basis: SDD
operation: Freq
keyword: #p
keyword: freq=noraman
keyword: PBEPBE/SDD
title: #p freq=noraman PBEPBE/SDD
converged: YES YES NO NO
title: Mulliken charges:
elementType: Cl Cl N N C C C C C C C C C C C C H H H H H H H H H H H H H H H H H H
charge: -0.076523 -0.067396 -0.104508 -0.387318 -0.352722 -0.448420 -0.325125 -0.322586 -0.671507 -0.670574 0.593017 -0.319277 -0.324304 -0.219126 -0.226962 -0.116421 0.225563 0.210734 0.246835 0.216464 0.205866 0.191617 0.195346 0.194346 0.299343 0.206557 0.228079 0.210101 0.209760 0.227151 0.208841 0.236464 0.275808 0.250876
chargesum: 0.00000
title: Mulliken charges with hydrogens summed into heavy atoms:
elementType: Cl Cl N N C C C C C C C C C C C C
charge: -0.076523 -0.067396 -0.104508 -0.087975 0.083575 0.014879 0.072358 0.067106 -0.026770 -0.024821 0.593017 -0.319277 -0.087840 0.056682 0.023914 -0.116421
polarizability: 2.25357358e+02 -1.64927174e+01 1.82079500e+02 1.22591375e+01 -1.50424200e+00 9.96294395e+01
1716.lowfreq: -4.0875 0.0009 0.0027 0.0030 1.8920 9.0957 21.4752 24.2552 31.9233
frequency: 21.3952 24.1117 31.9171 70.5609 72.6864 85.3124 105.1761 147.4856 166.4500 178.9469 188.1917 213.5789 243.3558 260.5336 290.5411 296.6777 325.1149 362.1194 379.2675 385.9143 394.9870 431.4983 443.8219 471.7603 483.6374 538.8331 580.3074 628.4285 685.1383 690.1723 748.7622 778.8494 790.9862 793.9678 796.2305 818.1360 857.6635 913.7543 924.0518 988.1031 1005.8941 1025.0597 1056.8507 1070.8175 1074.3833 1084.2735 1085.1779 1094.2282 1121.5726 1146.6052 1182.5773 1207.0840 1237.7994 1255.3706 1280.1373 1289.3268 1300.0889 1312.6781 1329.1336 1359.3851 1365.0968 1366.7814 1381.8070 1384.9192 1388.3045 1407.4983 1447.5030 1461.1178 1462.9267 1469.1103 1473.2147 1479.6741 1485.1203 1486.6082 1491.0830 1509.4573 1565.3699 1619.6108 2856.0498 2863.8372 2895.6277 2981.8378 2985.1067 2991.7847 3012.4216 3035.2843 3043.8114 3071.3669 3074.6566 3077.9875 3091.2310 3092.6946 3155.2958 3175.8562 3181.5580 3549.2309
redmass: 3.7958 4.6318 5.3749 2.6107 2.4600 2.8250 4.5731 2.3351 5.7242 4.0243 2.7629 1.3137 2.5364 1.9414 2.0717 3.1954 5.3698 7.1925 4.0706 5.7146 3.3037 3.1728 2.8137 1.1565 2.7874 3.8974 3.9218 5.5554 5.3728 3.8179 2.5606 1.5749 1.5145 1.1383 1.2916 2.6381 1.3608 1.9221 1.3280 2.3376 4.5735 3.7190 1.9132 2.5569 1.8312 2.1591 2.3116 2.9980 1.8336 1.4105 1.7033 2.2450 1.4633 1.4293 1.1589 1.2327 1.1534 1.9323 1.4091 1.3524 1.4373 2.4453 1.3635 1.2293 1.2287 5.3418 1.8294 1.0596 1.0530 1.0630 1.0740 1.0574 1.0728 1.0825 1.0771 2.8332 5.1594 6.7982 1.0718 1.0713 1.0704 1.0357 1.0358 1.0649 1.0875 1.0872 1.0880 1.1004 1.0985 1.0984 1.1004 1.1004 1.0873 1.0963 1.0935 1.0766
irintensity: 0.1933 0.1782 0.0506 0.1423 0.2685 0.0531 0.1883 0.1844 0.0339 1.8839 0.4064 0.2230 2.1076 1.3145 1.4675 1.2938 1.3190 5.2892 1.5837 4.6292 5.3097 12.1249 6.1961 98.3565 19.8917 2.8519 4.7194 29.4280 45.2865 5.2656 5.6861 6.2667 39.3995 8.1499 12.9955 13.5215 24.3118 0.7888 0.1794 4.2636 21.0022 9.2835 19.7966 45.6606 18.9445 7.5679 4.7539 14.0537 14.1546 2.8813 34.5441 44.8366 10.0391 12.6319 14.3050 17.8891 7.3384 33.7113 4.4403 2.7818 2.5607 55.7030 13.4801 19.8162 23.2401 3.2942 36.7620 4.6894 7.1729 2.7831 4.8631 5.3698 7.7161 28.1111 14.2669 318.5337 8.0556 148.5970 31.1495 137.0092 99.6935 31.0375 34.2127 42.5302 34.5314 14.6807 15.2744 37.4410 50.8157 66.9798 34.0956 46.2162 8.8411 6.5659 0.9499 46.0081
temp: 298.150 k
press: 1.00000 atm
elementType: 17 17 7 7 6 6 6 6 6 6 6 6 6 6 6 6 1 1 1 1 1 1 1 1 1 1 1 1 1 1 1 1 1 1
symmnumber: 1
zpe: 732758.8 jmol-1
zpe.correction: 0.279093 hartree
zpe.thermalcorrener: 0.297148 hartree
zpe.thermalcorrenthalpy: 0.298093 hartree
zpe.thermalcorrgfe: 0.230334 hartree
zpe.sumelectzpe: -1496.441939 hartree
zpe.sumelectthermal: -1496.423884 hartree
zpe.sumelectthermalent: -1496.422940 hartree
zpe.sumelectthermalfe: -1496.490699 hartree
dipole: -4.2800 -0.0092 0.1411
dipole: 4.2823
quadrupole: -117.6383 -108.6996 -114.4377
quadrupole: 3.7512 -2.7019 0.7095
quadrupole: -4.0465 4.8922 -0.8458 3.7512 -2.7019 0.7095
hfenergy: -1496.7210322 hartree
pointgroup: C01 [X(C12H18Cl2N2)]
dipole: -1.6836229 0.0200831 -0.0596948 debye
polarizability: 222.4894366|-7.7234715|166.5897972|25.146222|-32.828342|117.9870636 unknown
InChI: InChI=1S/C12H18Cl2N2/c1-3-16(4-2)8-7-15-12-6-5-10(13)9-11(12)14/h5-6,9,15H,3-4,7-8H2,1-2H3
charge 0 multiplicity 1
34 atoms
Cl 2.652129 2.684114 -1.220084
Cl 5.049044 -1.481378 1.596347
N  -3.322995 -0.166157 0.01353
N  0.165947 0.940287 -1.071157
C  -2.025832 0.542165 0.12497
C  -1.165187 0.331195 -1.151804
C  -4.459537 0.566392 0.634667
C  -3.237889 -1.588539 0.445316
C  -4.915202 1.780627 -0.196443
C  -4.293833 -2.489605 -0.222887
C  1.262358 0.371122 -0.439632
C  2.525758 1.038443 -0.413735
C  1.217403 -0.906093 0.201804
C  3.672649 0.504722 0.190125
C  2.35627 -1.469141 0.811821
C  3.572125 -0.761057 0.802035
H  -1.444905 0.224405 1.024136
H  -2.209275 1.625337 0.241045
H  -1.705274 0.772287 -2.007574
H  -1.072252 -0.750582 -1.369801
H  -5.307107 -0.13801 0.716269
H  -4.21614 0.889799 1.678446
H  -2.234011 -1.964902 0.169949
H  -3.310542 -1.67937 1.558932
H  0.303986 1.863864 -1.483119
H  -4.114414 2.535791 -0.299378
H  -5.21076 1.456722 -1.2095
H  -5.77897 2.276161 0.284834
H  -5.322817 -2.180968 0.035285
H  -4.191919 -2.444804 -1.321064
H  -4.168847 -3.53874 0.104196
H  0.27751 -1.464194 0.223892
H  4.614824 1.058102 0.181258
H  2.292003 -2.449097 1.29332
