program: Gaussian 09
title: 000224494
version: EM64L-G09RevD.01
frameworkgroup: C1[X(C13H10ClNO3)]
method: RPBEPBE
basis: SDD
operation: Freq
keyword: #p
keyword: freq=noraman
keyword: PBEPBE/SDD
title: #p freq=noraman PBEPBE/SDD
converged: YES YES NO NO
title: Mulliken charges:
elementType: Cl O O O N C C C C C C C C C C C C C H H H H H H H H H H
charge: -0.056762 -0.294630 -0.208721 -0.206522 0.027288 0.389565 -0.388572 -0.339230 -0.377789 0.375625 0.399410 -0.361754 -0.343850 -0.325614 -0.368458 -0.206102 -0.181675 -0.120299 0.232206 0.232228 0.239795 0.285191 0.287544 0.287223 0.253087 0.256302 0.255388 0.259128
chargesum: 0.00000
title: Mulliken charges with hydrogens summed into heavy atoms:
elementType: Cl O O O N C C C C C C C C C C C C C
charge: -0.056762 -0.294630 -0.208721 -0.206522 0.027288 0.389565 0.075862 -0.099435 -0.092598 0.375625 0.399410 -0.074210 -0.056627 -0.072527 -0.112157 0.049286 0.077453 -0.120299
polarizability: 2.93826247e+02 2.55318074e+00 1.65040333e+02 1.34657673e-01 -5.74665541e-02 6.60307378e+01
1716.lowfreq: 0.0016 0.0023 0.0026 2.5345 3.5908 10.0325 18.0870 21.7657 47.9131
frequency: 17.9387 21.6764 47.9120 65.0889 71.1216 133.0741 140.4927 141.9809 187.2940 248.0344 279.4607 312.6832 321.7068 356.7863 408.5881 414.1888 437.9512 464.4351 472.9222 497.7622 511.0182 611.9343 621.5061 628.4875 664.4943 666.5299 695.6530 719.3473 764.3223 800.5558 802.9773 822.7509 832.3372 842.1832 863.6613 927.0168 952.4697 983.2889 991.7283 1000.4458 1002.3295 1008.6727 1022.1327 1073.5467 1093.4453 1110.6464 1112.3087 1175.9642 1179.9881 1210.3800 1217.7068 1219.2292 1229.7743 1292.0257 1295.1241 1343.6362 1370.0345 1378.0188 1404.2418 1408.2786 1422.8276 1461.6603 1479.2016 1485.4296 1585.9336 1599.8900 1605.6181 1615.3121 2937.3407 2988.0794 3131.7345 3157.4101 3160.7878 3175.7031 3176.3760 3181.3086 3183.8896 3194.3559
redmass: 4.3581 10.8656 8.8819 7.3674 7.1738 7.5862 3.1437 10.0333 10.2405 7.4190 4.2440 5.3048 7.0388 11.2680 2.9072 2.9917 8.8551 5.4777 3.0554 2.7053 6.5185 7.3318 7.2007 7.1232 7.4900 4.9327 3.4959 3.4693 7.2436 1.3010 7.0122 1.5376 5.0996 1.4165 1.3002 1.3433 1.3465 1.3382 4.0294 6.5732 1.3977 3.2483 1.6763 2.5898 3.2635 1.3121 1.2940 1.1951 1.2805 2.5211 1.0707 4.9068 5.1604 1.2579 1.3092 2.1646 6.5976 4.1297 3.7467 5.9245 2.9921 1.2896 1.9235 2.2918 7.3249 7.8416 6.6573 6.1859 1.0552 1.1046 1.0908 1.0879 1.0886 1.0892 1.0966 1.0977 1.0946 1.0964
irintensity: 0.3020 1.0945 1.6865 0.1552 2.0938 1.0528 4.7637 0.5389 1.3213 1.1837 6.7509 0.6439 0.7904 5.4483 0.0368 0.0011 0.6524 0.1155 10.3461 25.5822 1.4286 36.2458 2.7132 0.2675 11.2938 18.4348 0.0278 12.6978 27.1185 11.6716 10.4770 66.4452 0.4314 50.9292 22.9752 0.2275 0.1136 4.3264 32.9114 100.0001 0.4003 5.2130 1.4353 44.7968 19.9983 23.2969 3.9196 78.8370 24.9160 110.3134 6.9923 552.5811 24.4380 0.4104 6.4915 13.5284 84.8792 27.5602 1.7142 8.7319 60.8547 185.6256 78.3194 28.3234 19.3566 1.1401 27.5152 52.1991 26.6668 23.1109 10.2146 11.6188 2.2106 1.0834 6.5819 0.9880 1.9179 0.5312
temp: 298.150 k
press: 1.00000 atm
elementType: 17 8 8 8 7 6 6 6 6 6 6 6 6 6 6 6 6 6 1 1 1 1 1 1 1 1 1 1
symmnumber: 1
zpe: 528953.7 jmol-1
zpe.correction: 0.201468 hartree
zpe.thermalcorrener: 0.217052 hartree
zpe.thermalcorrenthalpy: 0.217996 hartree
zpe.thermalcorrgfe: 0.155253 hartree
zpe.sumelectzpe: -1240.499871 hartree
zpe.sumelectthermal: -1240.484287 hartree
zpe.sumelectthermalent: -1240.483342 hartree
zpe.sumelectthermalfe: -1240.546086 hartree
dipole: 3.4393 2.4351 0.0198
dipole: 4.2142
quadrupole: -170.2602 -97.6434 -114.0428
quadrupole: -6.3621 -0.0441 0.0552
quadrupole: -42.9448 29.6721 13.2727 -6.3621 -0.0441 0.0552
hfenergy: -1240.7013387 hartree
pointgroup: C01 [X(C13H10Cl1N1O3)]
dipole: -1.3633529 0.6217655 0.7096274 debye
polarizability: 293.7515987|2.9932262|111.4607726|-4.3098449|49.2557275|119.6849468 unknown
InChI: InChI=1S/C13H10ClNO3/c14-11-3-7-13(8-4-11)18-9-10-1-5-12(6-2-10)15(16)17/h1-8H,9H2
charge 0 multiplicity 1
28 atoms
Cl -7.158438 -0.30831 0.021486
O  -1.131816 -0.296135 -0.180129
O  6.156138 0.474779 0.433428
O  5.683138 -1.030068 -1.213656
N  5.326867 -0.201633 -0.289856
C  1.130684 0.336597 0.425647
C  -0.343757 0.555927 0.709828
C  2.086321 1.056876 1.189511
C  1.571196 -0.562035 -0.575714
C  3.875717 -0.01527 -0.042423
C  -2.532435 -0.236575 -0.067338
C  3.463876 0.887629 0.962951
C  2.94796 -0.743535 -0.816394
C  -3.229963 0.593474 0.844312
C  -3.243936 -1.086202 -0.949806
C  -4.644334 0.569038 0.868718
C  -4.65131 -1.110104 -0.92511
C  -5.335777 -0.279163 -0.01274
H  -0.569595 0.306613 1.768803
H  -0.609704 1.622146 0.544713
H  1.753297 1.754669 1.967193
H  0.827869 -1.111404 -1.157243
H  4.216445 1.431452 1.539446
H  3.311657 -1.431363 -1.584175
H  -2.704105 1.257966 1.535409
H  -2.684473 -1.718607 -1.64508
H  -5.19266 1.205761 1.568771
H  -5.206061 -1.763825 -1.603856
