program: Gaussian 09
title: 000224508
version: EM64L-G09RevD.01
frameworkgroup: C1[X(C18H14ClNO5S)]
method: RPBEPBE
basis: SDD
operation: Freq
keyword: #p
keyword: freq=noraman
keyword: PBEPBE/SDD
title: #p freq=noraman PBEPBE/SDD
converged: YES YES NO NO
title: Mulliken charges:
elementType: Cl S O O O O O N C C C C C C C C C C C C C C C C C C H H H H H H H H H H H H H H
charge: -0.045616 0.237927 -0.259097 -0.411646 -0.219113 -0.407623 -0.233831 -0.019726 -0.387511 0.421256 0.422437 -0.128400 -0.089060 -0.517527 -0.510342 -0.346505 -0.455666 -0.301997 0.324282 -0.282147 -0.351074 -0.251508 -0.123795 0.237302 0.201132 -0.536618 0.344119 0.281904 0.290977 0.284913 0.289746 0.269488 0.291565 0.251078 0.259449 0.388106 0.224925 0.224201 0.251742 0.382254
chargesum: 0.00000
title: Mulliken charges with hydrogens summed into heavy atoms:
elementType: Cl S O O O O O N C C C C C C C C C C C C C C C C C C
charge: -0.045616 0.237927 -0.259097 -0.023540 -0.219113 -0.025369 -0.233831 -0.019726 -0.387511 0.421256 0.422437 -0.128400 -0.089060 -0.173408 -0.228438 -0.055528 0.118993 -0.032509 0.324282 0.009418 -0.099996 0.007941 -0.123795 0.237302 0.201132 0.164250
polarizability: 4.28625278e+02 -2.32576640e+01 2.74426808e+02 -2.99255572e+00 -3.41648381e+01 1.48923487e+02
1716.lowfreq: -3.1490 -0.0018 -0.0015 0.0003 0.2076 3.5442 13.2022 16.8164 33.2466
frequency: 13.1040 16.7997 33.2325 39.8599 44.1088 66.1289 69.8389 79.2397 103.3972 109.9995 111.1084 118.5985 144.0034 172.4576 194.8003 218.1348 238.8817 247.8157 250.1086 261.8212 266.0694 289.4325 313.4229 343.3305 377.7715 395.1397 412.3073 421.4205 440.7029 477.0758 486.5814 504.6430 517.0322 527.5679 533.0239 554.4932 571.6362 591.3589 607.4345 624.1366 637.8695 641.3122 644.3497 647.4262 684.0146 737.6816 740.3727 768.6870 786.5972 795.8389 800.9862 824.4091 837.0311 868.8110 872.6766 889.9070 893.2902 916.3644 942.1563 969.4281 975.0471 987.0684 998.8402 1037.7627 1054.2004 1056.9537 1109.9151 1113.7446 1127.9406 1144.7268 1153.0541 1172.7481 1188.1017 1195.4962 1215.0007 1236.1192 1248.0814 1251.6840 1270.0091 1282.7417 1295.7711 1331.0831 1345.4046 1368.5694 1371.5180 1397.3322 1417.8347 1422.7957 1435.0227 1451.5498 1470.6702 1471.5919 1479.7085 1518.0506 1532.6269 1535.1975 1600.1845 1634.7432 1656.8098 1660.5673 2966.2644 3021.9864 3058.0608 3078.7028 3095.7572 3130.2440 3147.7584 3154.0086 3165.0837 3175.4002 3175.5041 3182.8343 3514.8852 3520.5092
redmass: 7.9253 7.8541 11.5860 6.9827 6.5850 5.1458 12.6031 3.9029 6.7324 5.7257 5.2233 4.9190 7.2690 5.5095 7.5537 1.4615 9.2771 3.8673 5.7560 5.2490 3.2383 5.8814 7.2387 7.9912 8.1592 7.2765 3.8887 6.9277 5.9894 3.0727 1.9456 3.3527 6.5558 2.9899 4.7500 3.2764 3.7112 3.9743 2.8702 7.9109 2.3678 2.9323 3.7543 2.5261 7.0488 5.8142 3.8118 6.9620 2.2160 5.5656 4.0688 1.5583 2.1007 4.3360 4.9857 1.4991 1.6511 6.6455 6.1471 1.3330 1.3496 2.3879 3.4150 3.3877 2.4316 2.1431 1.2546 1.9108 1.6447 1.5105 1.4284 1.1928 2.0173 1.3157 1.6654 3.3776 1.4431 1.5923 1.6118 3.0005 4.0905 2.4981 2.0297 1.9835 4.0420 6.8937 4.5614 1.0980 1.3349 2.5185 1.0657 1.1087 2.8732 7.4814 9.6170 8.2665 6.6915 7.0609 8.4927 8.6880 1.0328 1.0615 1.1045 1.0972 1.0885 1.0997 1.0894 1.0869 1.0910 1.0960 1.0974 1.0935 1.0640 1.0641
irintensity: 0.1079 0.0951 0.9351 1.6305 0.4453 0.4881 0.9766 6.0651 0.3907 1.3348 2.0740 0.5536 1.2712 1.0141 1.5213 0.2277 1.0178 3.5454 0.8844 4.4626 4.4443 0.1344 0.5538 0.6413 4.8904 1.8409 6.5615 4.1992 6.7897 1.2957 18.6288 69.9686 0.8737 18.4859 35.5603 4.9286 72.7739 38.5880 40.2291 6.2828 38.1201 58.9038 9.1863 81.5567 1.6013 9.0525 2.5508 6.8029 0.3181 9.4532 15.3420 92.3217 0.0587 7.0547 17.6328 40.9440 3.8474 76.4445 20.1147 0.9585 0.6319 9.3200 88.1651 70.6988 432.6199 20.4721 0.1425 5.2198 8.8260 6.9882 54.1613 14.0605 226.1754 4.7339 7.2469 22.2557 4.4633 19.8281 7.7407 127.9100 0.5833 9.0906 84.2641 58.1293 0.3905 33.2338 39.6929 39.2013 44.8189 100.8904 30.2007 65.1807 48.2468 46.3079 3.2680 13.8356 8.3379 195.0261 302.8387 164.6559 101.1100 4.9505 42.6856 0.2416 0.3473 22.3613 2.8414 3.1991 2.8142 2.8800 14.2630 1.5415 29.5459 38.2336
temp: 298.150 k
press: 1.00000 atm
elementType: 17 16 8 8 8 8 8 7 6 6 6 6 6 6 6 6 6 6 6 6 6 6 6 6 6 6 1 1 1 1 1 1 1 1 1 1 1 1 1 1
symmnumber: 1
zpe: 743422.3 jmol-1
zpe.correction: 0.283155 hartree
zpe.thermalcorrener: 0.307519 hartree
zpe.thermalcorrenthalpy: 0.308463 hartree
zpe.thermalcorrgfe: 0.225468 hartree
zpe.sumelectzpe: -1981.473141 hartree
zpe.sumelectthermal: -1981.448776 hartree
zpe.sumelectthermalent: -1981.447832 hartree
zpe.sumelectthermalfe: -1981.530827 hartree
dipole: 4.2783 -1.1085 0.6999
dipole: 4.4746
quadrupole: -145.1051 -162.4433 -162.4822
quadrupole: -23.7918 13.5804 0.3642
quadrupole: 11.5718 -5.7665 -5.8053 -23.7918 13.5804 0.3642
hfenergy: -1981.7562952 hartree
pointgroup: C01 [X(C18H14Cl1N1O5S1)]
dipole: 1.2184629 1.2527541 -0.2124759 debye
polarizability: 364.2247264|79.7697931|337.6841477|29.495158|-21.9716884|150.0666986 unknown
InChI: InChI=1S/C18H14ClNO5S/c1-25-10-3-5-13-12(7-10)17(26-15(18(23)24)8-16(21)22)11-4-2-9(19)6-14(11)20-13/h2-7,15,21,23H,8H2,1H3
charge 0 multiplicity 1
40 atoms
Cl -5.983057 -1.22717 -0.858704
S  0.797715 -0.927198 1.674441
O  3.212043 3.651548 0.699269
O  0.002991 -4.11694 1.205482
O  2.32631 -4.158361 1.268994
O  3.834381 -2.388838 -2.351946
O  1.894076 -3.637852 -2.081699
N  -2.008622 2.084859 -0.650075
C  -0.295397 0.233571 0.73779
C  0.190376 1.536768 0.405993
C  -1.624995 -0.144929 0.395214
C  -0.736075 2.434676 -0.29521
C  -2.448995 0.832082 -0.322142
C  1.160691 -2.218284 0.279347
C  1.505996 2.007651 0.709836
C  -2.205402 -1.425416 0.710599
C  2.442559 -1.840328 -0.469973
C  -0.28584 3.755291 -0.640672
C  1.90279 3.299001 0.353431
C  -3.792317 0.48263 -0.704022
C  0.996096 4.188509 -0.328584
C  -3.506973 -1.737394 0.332375
C  -4.285665 -0.769493 -0.380971
C  1.266824 -3.57819 0.951191
C  2.653614 -2.726144 -1.686347
C  3.688243 4.996478 0.356305
H  0.275875 -2.212131 -0.374804
H  2.213468 1.359201 1.233719
H  -1.61336 -2.161544 1.263936
H  2.3991 -0.787387 -0.802177
H  3.323641 -1.934403 0.189233
H  -0.998838 4.402116 -1.160054
H  -4.38122 1.230726 -1.239865
H  1.310002 5.199528 -0.604121
H  -3.942326 -2.710382 0.576678
H  0.103425 -5.001081 1.651536
H  3.087684 5.778186 0.85946
H  3.680415 5.161357 -0.738122
H  4.722838 5.030862 0.726846
H  3.952527 -2.985275 -3.140689
