program: Gaussian 09
title: 000224483
version: EM64L-G09RevD.01
frameworkgroup: C1[X(C11H14BrNO2)]
method: RPBEPBE
basis: SDD
operation: Freq
keyword: #p
keyword: freq=noraman
keyword: PBEPBE/SDD
title: #p freq=noraman PBEPBE/SDD
converged: YES YES NO NO
title: Mulliken charges:
elementType: Br O O N C C C C C C C C C C C H H H H H H H H H H H H H H
charge: -0.012208 -0.329453 -0.246107 -0.431578 0.012586 -0.607362 -0.677226 0.232003 0.486429 -0.443380 -0.351512 -0.502804 -0.197122 -0.214550 -0.254347 0.238547 0.320820 0.231916 0.245975 0.219005 0.374696 0.226797 0.305515 0.235946 0.216736 0.241214 0.224947 0.226386 0.228129
chargesum: 0.00000
title: Mulliken charges with hydrogens summed into heavy atoms:
elementType: Br O O N C C C C C C C C C C C
charge: -0.012208 -0.329453 -0.246107 -0.056882 0.251133 -0.286542 0.019670 0.232003 0.486429 -0.216582 -0.045997 0.191092 0.027825 0.011836 -0.026218
polarizability: 2.05486674e+02 5.38175607e+00 1.32901441e+02 -3.73347366e+00 -1.66756980e+01 1.24762633e+02
1716.lowfreq: -0.0008 -0.0007 -0.0007 2.3776 5.0813 8.8971 32.7176 42.2474 72.7396
frequency: 32.6704 42.2034 72.6430 75.6051 91.6364 106.2062 134.2751 138.7277 169.8790 201.9353 207.9439 263.8613 275.7903 297.6336 327.9891 354.6139 408.2515 420.1747 483.6887 514.0244 563.5131 613.0165 638.0328 691.5221 696.2455 743.0822 768.9364 773.8575 833.4657 843.4416 871.5532 895.3891 921.7726 946.0166 974.2003 984.3964 991.1840 999.4525 1026.1917 1031.0304 1085.4780 1091.2376 1114.4750 1118.1235 1159.9550 1168.4864 1172.0179 1187.2260 1221.0741 1269.6526 1277.0253 1297.2774 1323.3974 1348.2545 1386.6859 1391.8253 1436.5799 1439.9106 1461.4450 1462.4277 1474.4653 1477.0640 1485.9063 1550.1273 1599.8625 1615.5417 1623.3512 2960.0543 2995.2864 3003.1207 3053.5329 3094.0490 3104.1661 3107.3460 3111.8658 3117.8701 3131.7770 3144.2130 3164.2980 3192.2116 3285.3215
redmass: 5.8644 4.4419 3.0751 3.5520 5.9278 5.0791 6.5550 4.8418 1.2535 2.4462 1.2488 3.9779 4.4844 4.9488 4.7526 5.3888 2.9234 3.7472 5.2223 3.2046 4.4116 6.4391 6.1168 5.8809 1.9270 5.0213 1.7349 2.9691 1.5683 2.3915 1.2870 2.7637 1.4520 2.3873 1.3526 5.3468 2.4579 1.3092 2.3005 3.9281 1.8687 1.7545 1.2599 1.6443 1.5944 1.2771 1.0520 1.1195 3.4424 1.6046 2.2912 1.2913 1.3928 1.2621 7.3853 1.2052 1.6084 1.4880 1.0498 1.0488 1.0541 1.0530 2.4106 2.3475 6.9801 5.6764 2.6449 1.0323 1.0364 1.0853 1.1036 1.0989 1.1004 1.0881 1.1008 1.0873 1.0874 1.0939 1.0998 1.0953 1.0812
irintensity: 0.6074 0.5901 1.7237 2.7897 1.0436 5.1035 0.9932 0.5265 0.9191 6.9078 0.8267 2.5525 2.2764 3.0207 0.1757 3.5185 0.0642 23.1200 24.9402 24.0054 17.1973 0.2387 13.9965 3.7498 38.3073 22.9777 49.1004 2.7961 30.9638 2.3001 47.8229 22.2890 26.5536 10.1432 0.0570 2.0219 6.0276 2.8451 9.3768 95.4401 12.4470 46.7489 0.6894 23.3815 6.0474 12.4871 0.6913 0.8701 13.0395 14.3392 17.4351 2.2946 16.6101 7.2046 21.4007 17.1955 33.5765 7.0356 10.2542 6.2060 4.9017 7.8400 57.0984 326.2064 183.8061 12.0622 122.5870 73.4227 12.9809 26.5582 37.2450 14.8281 19.5867 5.8767 22.4487 9.1317 1.0826 32.4352 28.0841 6.4570 303.4814
temp: 298.150 k
press: 1.00000 atm
elementType: 35 8 8 7 6 6 6 6 6 6 6 6 6 6 6 1 1 1 1 1 1 1 1 1 1 1 1 1 1
symmnumber: 1
zpe: 604892.0 jmol-1
zpe.correction: 0.230391 hartree
zpe.thermalcorrener: 0.246023 hartree
zpe.thermalcorrenthalpy: 0.246968 hartree
zpe.thermalcorrgfe: 0.185523 hartree
zpe.sumelectzpe: -645.104433 hartree
zpe.sumelectthermal: -645.088801 hartree
zpe.sumelectthermalent: -645.087857 hartree
zpe.sumelectthermalfe: -645.149302 hartree
dipole: -2.1217 4.7839 -0.4720
dipole: 5.2545
quadrupole: -85.8486 -98.9764 -97.9862
quadrupole: -6.9545 -5.1326 -1.7290
quadrupole: 8.4218 -4.7060 -3.7158 -6.9545 -5.1326 -1.7290
hfenergy: -645.3348246 hartree
pointgroup: C01 [X(C11H14Br1N1O2)]
dipole: -1.3752896 0.5086228 -1.457233 debye
polarizability: 191.8304487|26.3172426|120.4746113|-17.611605|-3.3344061|150.8456883 unknown
InChI: InChI=1S/C11H14BrNO2/c1-8(15-2)10(12)11(14)13-9-6-4-3-5-7-9/h3-8,10,13H,1-2H3
charge 0 multiplicity 1
29 atoms
Br -2.196159 -2.599335 1.640143
O  -2.460391 -0.109096 -0.564068
O  0.081348 0.030054 2.91622
N  0.028967 -0.124404 0.558503
C  -2.943508 0.140549 0.816972
C  -2.02227 -0.559234 1.840092
C  -2.978259 1.663013 1.051759
C  -0.525861 -0.188617 1.822858
C  1.379855 0.135094 0.202482
C  1.69419 0.140717 -1.184799
C  2.405445 0.374834 1.157767
C  -3.400668 -0.837597 -1.426288
C  3.015048 0.37783 -1.613091
C  3.723662 0.609748 0.710886
C  4.040592 0.613684 -0.666886
H  -3.960812 -0.284906 0.924589
H  -2.3857 -0.382904 2.86371
H  -3.649306 2.132825 0.31269
H  -1.973409 2.103262 0.934219
H  -3.349938 1.900834 2.064776
H  -0.653386 -0.263856 -0.210127
H  0.902088 -0.044335 -1.921221
H  2.158585 0.373843 2.221002
H  -2.911297 -0.912017 -2.410221
H  -4.350451 -0.277297 -1.532826
H  -3.602279 -1.851189 -1.031821
H  3.243928 0.377056 -2.684596
H  4.510258 0.791706 1.451925
H  5.06793 0.796841 -0.99935
