program: Gaussian 09
title: 000224479
version: EM64L-G09RevD.01
frameworkgroup: C1[X(C9H13NO6)]
method: RPBEPBE
basis: SDD
operation: Freq
keyword: #p
keyword: freq=noraman
keyword: PBEPBE/SDD
title: #p freq=noraman PBEPBE/SDD
converged: YES YES NO NO
title: Mulliken charges:
elementType: O O O O O O N C C C C C C C C C H H H H H H H H H H H H H
charge: -0.399725 -0.294529 -0.234018 -0.417256 -0.226167 -0.289080 -0.421837 -0.153308 -0.390963 -0.483471 0.124897 0.182132 0.296015 -0.360214 -0.041665 -0.530121 0.305710 0.283262 0.249727 0.271785 0.257913 0.359756 0.391098 0.222505 0.240360 0.378629 0.228501 0.218655 0.231408
chargesum: 0.00000
title: Mulliken charges with hydrogens summed into heavy atoms:
elementType: O O O O O O N C C C C C C C C C
charge: -0.008626 -0.294529 -0.234018 -0.038628 -0.226167 -0.289080 -0.062081 0.152402 0.142027 0.046227 0.124897 0.182132 0.296015 0.102651 0.186836 -0.080057
polarizability: 1.29233769e+02 -1.00459771e+01 1.22196365e+02 5.45016688e-01 1.07212886e+01 1.12138269e+02
1716.lowfreq: -3.9975 -0.0008 -0.0008 -0.0004 5.6726 8.4616 17.5776 20.7311 35.8742
frequency: 17.5368 20.4691 35.7330 46.2479 53.9420 68.7669 81.1392 96.0787 100.1065 108.2811 159.4768 199.8233 230.3329 266.1781 313.7480 319.6213 365.1843 413.5960 425.5638 456.9089 505.8979 547.2088 559.0351 583.5570 615.1978 637.9156 639.5253 657.6096 665.1690 702.1252 729.7693 776.5285 824.9095 882.4261 897.3464 908.2640 934.5813 961.1061 970.2020 993.4456 1003.2467 1030.0949 1058.8751 1067.4907 1096.0786 1145.8290 1162.4060 1185.6668 1205.6529 1224.5543 1249.1169 1252.5684 1274.6728 1285.6016 1291.7007 1335.4060 1338.9908 1358.4366 1384.9203 1426.4439 1441.5990 1458.7995 1470.6864 1478.6379 1645.7682 1658.2610 1661.8629 1669.8500 2994.1566 3004.4527 3030.4183 3035.5749 3044.0831 3092.5199 3099.4749 3100.1380 3119.6791 3205.0286 3513.8122 3518.9496 3526.8625
redmass: 11.7579 5.6088 4.4882 5.0336 9.6790 4.3270 7.7629 3.1327 3.1658 3.1937 5.7152 4.5890 4.9230 4.4233 4.2182 4.6394 2.7660 2.4238 4.3998 3.5443 1.8200 3.4696 2.5220 4.7564 1.2089 1.5781 1.3449 4.0891 2.0251 7.8383 4.7055 1.6262 3.5394 4.2648 3.3553 2.6284 1.9515 2.0229 1.3672 3.6136 1.1803 2.6105 2.7346 2.2561 2.4962 2.5587 2.0515 1.3572 2.0726 1.3739 1.5030 1.1752 1.5011 1.2447 1.1850 1.3390 1.4616 1.8994 1.7609 1.1581 1.0951 1.1388 1.1035 1.9948 9.8122 5.6708 6.4710 8.2905 1.0610 1.0819 1.0573 1.0616 1.0981 1.0665 1.0971 1.1038 1.0986 1.1151 1.0640 1.0644 1.0775
irintensity: 0.9360 0.1278 0.4543 1.0952 0.1038 0.7615 5.0568 2.2129 1.3785 1.1076 5.0873 0.8431 1.5164 13.8036 8.7404 7.1593 8.9099 2.2679 23.2215 8.2313 36.5677 47.2583 94.1449 28.2533 9.6241 147.0780 120.2267 15.7607 11.1719 66.6904 8.9203 29.2906 7.2485 4.6316 22.0896 34.4553 55.5438 16.5285 96.7862 346.1599 22.5543 119.5487 132.4542 77.9678 33.9025 87.6653 5.6355 39.8287 89.6478 19.7055 2.7621 10.8013 12.2052 0.1884 3.7958 35.5791 63.4233 126.5306 51.8414 10.4772 32.0473 17.3024 24.0209 395.8267 334.9406 23.8676 39.8269 237.9217 9.6750 14.5538 38.9349 7.7056 4.4964 3.8681 7.0389 8.6242 13.7062 20.9724 22.8646 49.1087 79.5867
temp: 298.150 k
press: 1.00000 atm
elementType: 8 8 8 8 8 8 7 6 6 6 6 6 6 6 6 6 1 1 1 1 1 1 1 1 1 1 1 1 1
symmnumber: 1
zpe: 579703.9 jmol-1
zpe.correction: 0.220798 hartree
zpe.thermalcorrener: 0.238420 hartree
zpe.thermalcorrenthalpy: 0.239365 hartree
zpe.thermalcorrgfe: 0.170947 hartree
zpe.sumelectzpe: -855.622481 hartree
zpe.sumelectthermal: -855.604858 hartree
zpe.sumelectthermalent: -855.603914 hartree
zpe.sumelectthermalfe: -855.672332 hartree
dipole: 0.9559 -0.4862 -1.7783
dipole: 2.0767
quadrupole: -78.2141 -86.8213 -103.5003
quadrupole: -6.2074 0.3432 -8.6503
quadrupole: 11.2978 2.6906 -13.9884 -6.2074 0.3432 -8.6503
hfenergy: -855.8432784 hartree
pointgroup: C01 [X(C9H13N1O6)]
dipole: -0.365711 -0.2801646 0.6747723 debye
polarizability: 127.6515837|10.3701962|125.531961|2.4013636|-9.3810304|110.3848578 unknown
InChI: InChI=1S/C9H13NO6/c1-2-5-16-9(15)10-6(8(13)14)3-4-7(11)12/h2,6,10-11,13H,1,3-5H2
charge 0 multiplicity 1
29 atoms
O  -2.779232 -2.555394 -0.826521
O  2.692289 -0.933413 0.626896
O  -1.510933 -2.877169 1.092967
O  -2.799733 2.645532 1.507793
O  -2.486008 2.733706 -0.791234
O  1.82455 -0.264441 -1.472969
N  0.495004 -1.28301 0.165995
C  -0.712259 -1.327162 -0.66322
C  -1.385738 0.067105 -0.853001
C  -1.800547 0.715928 0.478357
C  -1.668254 -2.327648 -0.020918
C  -2.376065 2.104253 0.282762
C  1.672879 -0.775452 -0.331924
C  3.997046 -0.280611 0.279912
C  4.036757 1.131924 0.809152
C  4.151764 2.22535 0.015264
H  -0.454527 -1.695669 -1.675543
H  -0.66228 0.710931 -1.381215
H  -2.260934 -0.054159 -1.514191
H  -0.932345 0.799955 1.160283
H  -2.554133 0.113432 1.022097
H  0.480863 -1.746518 1.078901
H  -3.39012 -3.205035 -0.384065
H  4.740091 -0.928668 0.773987
H  4.128441 -0.305944 -0.815204
H  -3.165488 3.558541 1.351595
H  3.966671 1.241708 1.900417
H  4.190181 3.237331 0.43425
H  4.200159 2.136094 -1.076522
