program: Gaussian 09
title: 000224480
version: EM64L-G09RevD.01
frameworkgroup: C1[X(C20H15N)]
method: RPBEPBE
basis: SDD
operation: Freq
keyword: #pfreq=noraman
keyword: PBEPBE/SDD
title: #p freq=noraman PBEPBE/SDD
converged: YES YES NO NO
title: Mulliken charges:
elementType: N C C C C C C C C C C C C C C C C C C C C H H H H H H H H H H H H H H H
charge: -0.526907 0.321986 0.322017 0.146313 0.146360 0.432301 0.432291 -0.419741 -0.419787 -0.372789 -0.372779 -0.472255 -0.472259 -0.234569 -0.234565 -0.425529 -0.425528 -0.263362 -0.263376 -0.243329 -0.243331 0.304780 0.269667 0.269670 0.214552 0.214528 0.237987 0.237988 0.225262 0.225264 0.237817 0.237817 0.227952 0.227953 0.228800 0.228801
chargesum: 0.00000
title: Mulliken charges with hydrogens summed into heavy atoms:
elementType: N C C C C C C C C C C C C C C C C C C C C
charge: -0.222128 0.321986 0.322017 0.146313 0.146360 0.432301 0.432291 -0.150074 -0.150117 -0.158237 -0.158251 -0.234269 -0.234271 -0.009307 -0.009301 -0.187713 -0.187711 -0.035410 -0.035423 -0.014529 -0.014529
polarizability: 3.82032630e+02 4.90293929e-03 2.47019698e+02 -3.57539828e+00 1.54359246e-03 1.23947704e+02
1716.lowfreq: -0.0006 -0.0003 0.0002 5.2123 5.2550 12.7560 31.9118 35.2842 60.3673
frequency: 31.9107 35.2170 60.3671 116.3481 130.8365 175.8673 176.2403 197.6822 224.7917 252.9525 314.2020 392.2752 413.3903 424.8979 428.1755 468.8752 472.9383 480.4638 492.6798 496.4584 521.1678 522.0873 562.7960 578.0398 594.8803 628.0070 641.0428 654.5457 715.3461 737.2382 739.4961 758.4670 776.2423 782.1146 782.5709 799.7910 800.7462 807.3809 845.2768 862.8630 874.5080 887.3165 891.4375 910.3403 953.3577 955.5170 970.3193 977.0362 988.7254 988.9912 1011.1379 1028.6603 1040.7354 1057.2111 1092.2525 1097.8349 1149.8335 1151.7057 1177.2250 1177.8242 1186.3871 1187.9017 1233.5779 1236.3504 1255.9991 1263.1102 1286.9502 1313.7145 1332.7425 1375.6302 1409.2814 1410.0113 1416.8590 1418.4315 1440.6463 1447.4300 1455.2139 1456.8054 1489.7837 1520.7722 1537.7388 1586.0123 1592.0591 1594.1651 1596.3716 1631.5755 1632.0926 3117.9238 3118.1424 3124.2240 3124.3163 3127.3284 3127.6800 3141.9646 3142.0846 3146.8283 3148.7970 3161.8103 3162.0595 3164.7751 3169.2682 3550.7496
redmass: 5.0487 4.8076 4.4600 4.0079 4.3963 3.9854 4.9888 4.8607 4.2507 4.2827 4.7315 4.0061 3.4474 3.3945 2.7131 3.3328 3.3935 1.5675 6.4531 5.6299 4.1969 7.0044 3.3222 3.1990 5.9717 4.1611 3.2162 4.8312 4.5304 1.3933 1.2996 3.7872 1.8892 3.6198 4.8346 2.1363 1.6893 1.9343 4.1858 1.5730 1.7913 4.4906 1.5478 1.3891 1.3727 1.3913 1.3521 1.3363 1.3512 1.3575 4.8143 2.8177 2.3237 2.2100 1.9872 2.0967 1.4410 1.4262 1.0890 1.0913 1.1932 1.2235 1.8881 1.9050 1.6545 1.6380 2.3950 2.3640 2.0015 2.2264 2.6085 3.0819 5.0062 7.7813 2.5167 2.2582 2.5747 2.5262 2.3914 4.0186 2.7269 7.2607 7.1423 5.7498 4.6188 6.8284 5.5289 1.0853 1.0853 1.0882 1.0883 1.0859 1.0861 1.0943 1.0944 1.0935 1.0944 1.1003 1.1004 1.0976 1.0961 1.0743
irintensity: 0.0312 0.8581 0.0037 1.1005 0.0127 4.6267 0.2260 0.3680 3.7976 1.7311 9.6677 0.5983 12.7836 2.3499 30.7892 8.1138 0.0297 84.6817 0.0042 5.8428 13.2670 0.3144 1.5909 36.0892 13.2822 0.2192 15.4931 1.7731 2.8271 0.5055 5.3620 3.3337 113.1091 8.2359 14.7891 25.2461 98.5052 9.2400 0.3747 11.2416 2.4940 1.8325 9.8262 0.0360 3.1554 0.5209 2.9044 1.1064 1.3924 0.4531 3.7301 12.0383 7.0059 1.6706 12.3817 22.7274 0.3113 2.5227 6.7614 0.0030 0.0076 6.7919 0.4718 2.9630 1.0975 1.9980 1.5956 89.2312 32.4063 4.1467 62.9478 0.2156 107.1959 5.9258 85.9947 1.5498 0.7368 121.8071 143.6779 14.9130 448.3653 210.6134 0.1345 17.6392 8.7972 7.3591 4.1639 12.3833 0.9063 0.3520 2.1179 0.8983 2.2183 50.9505 6.7103 51.9156 30.7013 43.2647 34.5699 3.5679 11.1677 11.4588
temp: 298.150 k
press: 1.00000 atm
elementType: 7 6 6 6 6 6 6 6 6 6 6 6 6 6 6 6 6 6 6 6 6 1 1 1 1 1 1 1 1 1 1 1 1 1 1 1
symmnumber: 1
zpe: 754330.5 jmol-1
zpe.correction: 0.287309 hartree
zpe.thermalcorrener: 0.302920 hartree
zpe.thermalcorrenthalpy: 0.303864 hartree
zpe.thermalcorrgfe: 0.243712 hartree
zpe.sumelectzpe: -824.497082 hartree
zpe.sumelectthermal: -824.481471 hartree
zpe.sumelectthermalent: -824.480527 hartree
zpe.sumelectthermalfe: -824.540679 hartree
dipole: 0.0002 -0.7643 0.0002
dipole: 0.7643
quadrupole: -106.6602 -109.3749 -127.5669
quadrupole: 0.0011 -0.6426 0.0003
quadrupole: 7.8738 5.1591 -13.0329 0.0011 -0.6426 0.0003
hfenergy: -824.7843909 hartree
pointgroup: C01 [X(C20H15N1)]
dipole: 0.0001169 -0.3007154 0.0001864 debye
polarizability: 381.9975272|0.0222071|247.0196904|-4.6734223|-0.0378952|123.9828153 unknown
InChI: InChI=1S/C20H15N/c1-3-11-17-15(7-1)9-5-13-19(17)21-20-14-6-10-16-8-2-4-12-18(16)20/h1-14,21H
charge 0 multiplicity 1
36 atoms
N  0.000161 -0.148847 -0.00025
C  -1.249652 0.464482 0.242826
C  1.249882 0.464633 -0.243356
C  -2.457347 -0.277847 -0.074246
C  2.457709 -0.277196 0.074361
C  -3.741787 0.290129 0.287119
C  3.742071 0.290934 -0.287058
C  -1.353534 1.736908 0.834822
C  1.353543 1.736746 -0.836076
C  -2.435464 -1.549968 -0.737714
C  2.436049 -1.548964 0.738512
C  -3.803703 1.587078 0.893898
C  3.803758 1.587559 -0.894546
C  -2.626164 2.294368 1.146591
C  2.626076 2.294385 -1.14789
C  -4.934528 -0.459742 0.014874
C  4.934963 -0.458459 -0.014158
C  -3.616025 -2.253954 -0.994885
C  3.61675 -2.252485 0.996307
C  -4.878699 -1.710124 -0.603351
C  4.879356 -1.708517 0.60474
H  0.000291 -1.168676 0.000189
H  -0.446549 2.287702 1.098893
H  0.446449 2.287112 -1.100669
H  -1.487445 -1.970636 -1.093511
H  1.488081 -1.969737 1.094329
H  -4.780514 2.009682 1.154075
H  4.780508 2.010283 -1.154758
H  -2.667125 3.284212 1.61446
H  2.666867 3.28397 -1.616321
H  -5.900138 -0.02551 0.300653
H  5.900509 -0.024117 -0.299983
H  -3.576676 -3.218801 -1.512169
H  3.577557 -3.217062 1.514105
H  -5.79805 -2.270706 -0.804684
H  5.798821 -2.268733 0.806569
