program: Gaussian 09
title: 000224488
version: EM64L-G09RevD.01
frameworkgroup: C1[X(C14H11N3O6)]
method: RPBEPBE
basis: SDD
operation: Freq
keyword: #p
keyword: freq=noraman
keyword: PBEPBE/SDD
title: #p freq=noraman PBEPBE/SDD
converged: YES YES NO NO
title: Mulliken charges:
elementType: O O O O O O N N N C C C C C C C C C C C C C C H H H H H H H H H H H
charge: -0.325201 -0.247514 -0.205702 -0.219899 -0.196390 -0.200640 -0.461667 0.017752 0.027991 0.327571 0.196009 0.277589 -0.282402 0.139467 -0.477210 0.419749 -0.392695 -0.319201 -0.319652 0.391161 -0.358677 -0.372889 -0.522993 0.364197 0.320389 0.300943 0.289886 0.287451 0.232320 0.293401 0.290931 0.238337 0.239411 0.248173
chargesum: 0.00000
title: Mulliken charges with hydrogens summed into heavy atoms:
elementType: O O O O O O N N N C C C C C C C C C C C C C C
charge: -0.325201 -0.247514 -0.205702 -0.219899 -0.196390 -0.200640 -0.097470 0.017752 0.027991 0.327571 0.196009 0.277589 0.037986 0.139467 -0.176266 0.419749 -0.102809 -0.031750 -0.087332 0.391161 -0.065276 -0.081958 0.202929
polarizability: 4.25761724e+02 -3.10336746e+00 2.14362380e+02 -5.77302700e+00 -8.41428798e+00 8.31405209e+01
1716.lowfreq: -7.2609 -2.8483 -1.6769 -0.0007 -0.0003 0.0003 19.1457 23.8370 41.7976
frequency: 19.1410 23.8106 41.7936 58.4398 63.9242 74.2813 87.2886 106.4826 130.1517 145.5668 159.9373 182.3452 187.5900 233.8004 244.0076 264.1091 291.1434 307.4756 346.4352 358.0015 407.3928 415.4464 452.4872 468.3451 482.7618 489.9261 502.6148 532.3792 555.2755 573.0326 623.4540 629.7055 657.2755 685.1263 691.0716 697.6026 727.0556 737.4396 758.2098 769.8618 782.1245 809.9534 846.5334 865.0502 871.8171 884.6573 886.9524 896.3788 986.1386 998.1255 999.4294 1003.4896 1011.2485 1075.0161 1087.3359 1093.8537 1113.7087 1117.4304 1124.6110 1155.7130 1185.3436 1197.6134 1206.9762 1219.9371 1246.7254 1254.2956 1294.2913 1308.3040 1359.6026 1366.7937 1399.5324 1402.5886 1412.0297 1424.8022 1448.1980 1466.5635 1468.8708 1475.5459 1490.8237 1518.3129 1577.5009 1599.9159 1606.1830 1608.0040 1615.5734 2980.5541 3076.8497 3135.6109 3139.3692 3166.7387 3184.8620 3185.3615 3188.0906 3190.3383 3204.3597 3490.2051
redmass: 8.5132 6.2672 8.5142 11.5306 6.8347 6.9051 6.9108 4.3490 8.2181 5.2092 5.3989 5.9496 1.9517 5.9536 2.3187 4.5936 6.6814 7.0066 7.3459 5.8410 2.8682 6.9628 4.1227 4.0909 6.5693 8.0114 7.6774 5.8259 5.0392 5.0526 7.1111 7.7606 5.8814 3.8922 6.5770 6.5720 1.6173 9.9589 3.1313 3.6125 6.0418 5.5188 1.4174 1.4008 4.2172 3.8339 2.2046 1.4697 1.3685 6.0563 1.3291 2.8576 1.4479 3.7802 2.4911 2.5614 1.3542 1.2558 1.6503 1.3633 1.3946 2.5338 7.4199 5.0294 2.0947 2.5614 1.5272 1.6724 9.1267 7.0880 4.1690 10.8360 3.9994 2.8191 1.6465 1.0997 1.4399 1.5649 2.3106 2.6350 7.4018 7.7228 5.9882 5.5765 7.0330 1.0319 1.1051 1.0906 1.1015 1.0898 1.0945 1.0905 1.0965 1.0914 1.0963 1.0759
irintensity: 1.9754 0.2031 1.4790 0.8964 0.0011 0.0408 3.0017 13.7179 2.9806 3.3590 3.3749 0.9559 1.0742 1.7929 1.0456 1.6110 5.5547 0.4149 6.1766 2.9531 0.1372 0.2508 5.0587 10.9620 2.0420 0.5182 4.2748 7.6465 1.8214 4.9768 0.8013 2.1048 4.5753 22.2292 9.1046 32.8580 36.6440 26.5490 11.0639 30.1584 74.6462 7.5566 9.5211 22.4874 23.0927 9.9899 28.2097 67.6164 2.2238 69.5034 0.9437 13.6378 0.3408 10.3182 92.4098 1.0282 43.0532 0.1593 29.4900 3.5146 20.9326 78.2031 1107.9509 106.4370 100.5320 29.8277 34.8543 75.0418 72.5815 94.7385 204.5952 3.7579 91.0653 40.3351 28.1795 29.6591 69.6157 19.0563 60.5706 602.8075 92.4108 130.6965 16.9203 3.7068 59.8821 45.5996 30.3857 10.8288 12.7789 1.3020 1.5318 1.9127 1.5237 5.4348 4.5003 44.6808
temp: 298.150 k
press: 1.00000 atm
elementType: 8 8 8 8 8 8 7 7 7 6 6 6 6 6 6 6 6 6 6 6 6 6 6 1 1 1 1 1 1 1 1 1 1 1
symmnumber: 1
zpe: 627372.1 jmol-1
zpe.correction: 0.238953 hartree
zpe.thermalcorrener: 0.259069 hartree
zpe.thermalcorrenthalpy: 0.260013 hartree
zpe.thermalcorrgfe: 0.187428 hartree
zpe.sumelectzpe: -1153.899626 hartree
zpe.sumelectthermal: -1153.879510 hartree
zpe.sumelectthermalent: -1153.878566 hartree
zpe.sumelectthermalfe: -1153.951151 hartree
dipole: -0.7166 3.9149 0.4317
dipole: 4.0033
quadrupole: -217.5546 -120.9734 -131.5780
quadrupole: 15.3595 0.7228 -0.6399
quadrupole: -60.8526 35.7286 25.1240 15.3595 0.7228 -0.6399
hfenergy: -1154.138579 hartree
pointgroup: C01 [X(C14H11N3O6)]
dipole: 0.3103142 -1.5437608 0.0347841 debye
polarizability: 425.3387694|-0.1088448|211.6336891|13.7814172|20.4454877|86.2921661 unknown
InChI: InChI=1S/C14H11N3O6/c1-23-13-8-11(17(21)22)6-7-12(13)15-14(18)9-2-4-10(5-3-9)16(19)20/h2-8,15H,1H3
charge 0 multiplicity 1
34 atoms
O  -1.499675 -2.141543 -0.105702
O  0.423789 2.379776 0.106855
O  -6.517591 1.306341 -0.285322
O  -6.474441 -0.976673 -0.30744
O  7.182768 0.56443 0.46326
O  6.680691 -1.475925 -0.426479
N  -0.207517 0.124529 -0.029696
N  -5.888377 0.178033 -0.26912
N  6.346752 -0.31011 0.015946
C  -1.610195 0.236287 -0.08241
C  -2.32699 -1.008479 -0.126711
C  2.177312 0.70845 0.011953
C  -2.333259 1.455151 -0.097274
C  0.734903 1.15297 0.03014
C  -3.725743 -1.034077 -0.187317
C  -4.413819 0.202632 -0.203658
C  -3.739954 1.439406 -0.159895
C  3.14027 1.639149 0.4823
C  2.607022 -0.554189 -0.47947
C  4.903219 0.046715 0.01177
C  4.508259 1.314806 0.491134
C  3.973114 -0.892652 -0.482067
C  -2.14222 -3.46287 -0.133721
H  0.120429 -0.846662 -0.002066
H  -1.780611 2.394496 -0.05575
H  -4.305322 -1.958923 -0.223387
H  -4.317402 2.366675 -0.173579
H  2.78858 2.615212 0.829537
H  1.893942 -1.271582 -0.901064
H  5.265673 2.013522 0.855283
H  4.329716 -1.853577 -0.861365
H  -2.725252 -3.59441 -1.063814
H  -2.797363 -3.59709 0.74655
H  -1.316809 -4.187915 -0.101518
