program: Gaussian 09
title: 000224474
version: EM64L-G09RevD.01
frameworkgroup: C1[X(C7H9Cl3O4S2)]
method: RPBEPBE
basis: SDD
operation: Freq
keyword: #p
keyword: freq=noraman
keyword: PBEPBE/SDD
title: #p freq=noraman PBEPBE/SDD
converged: YES YES NO NO
title: Mulliken charges:
elementType: Cl Cl Cl S S O O O O C C C C C C C H H H H H H H H H
charge: 0.096078 0.143844 0.124738 0.138164 0.204009 -0.267363 -0.261941 -0.216253 -0.233037 -0.578742 -0.474074 0.357169 0.288570 -0.501807 -0.504836 -0.672276 0.333969 0.280854 0.273380 0.233392 0.259009 0.246570 0.250346 0.241724 0.238513
chargesum: 0.00000
title: Mulliken charges with hydrogens summed into heavy atoms:
elementType: Cl Cl Cl S S O O O O C C C C C C C
charge: 0.096078 0.143844 0.124738 0.138164 0.204009 -0.267363 -0.261941 -0.216253 -0.233037 -0.244773 0.080159 0.357169 0.288570 0.237163 0.225748 -0.672276
polarizability: 2.08243955e+02 2.25195019e+01 1.53071213e+02 -2.44036720e+00 -5.14286432e+00 1.27998884e+02
1716.lowfreq: -3.1913 -0.0026 -0.0003 0.0012 3.3629 6.1689 17.6127 18.8918 27.6620
frequency: 17.5715 18.8447 27.6368 41.1315 51.5615 72.4577 91.1487 97.8188 103.2640 110.0008 118.2650 134.0029 158.2533 174.0784 196.7180 216.5247 238.0740 256.0749 271.9896 286.1704 291.4584 307.7813 341.8145 362.2804 391.7357 418.6927 465.7420 544.9272 596.8353 640.2791 644.0817 659.3802 662.0354 698.2629 749.7174 799.4504 863.6325 921.4541 945.0739 991.7550 1062.4107 1113.0402 1113.9231 1137.6106 1150.6249 1151.7423 1153.7953 1190.3122 1231.4222 1270.7704 1360.8402 1420.6634 1423.5220 1433.0440 1452.9517 1453.3506 1462.9209 1463.0585 1616.9310 1644.1101 3004.6228 3008.7005 3010.4405 3051.2792 3085.8790 3112.6213 3117.6792 3155.4939 3156.0077
redmass: 5.3430 9.6294 10.3697 9.5873 5.1243 7.5435 1.4169 2.0931 1.6537 3.0600 8.1352 10.5689 4.6190 5.1957 19.3977 15.0822 6.2989 4.9084 16.3787 23.5729 3.5356 23.3099 4.0982 7.8946 33.5508 25.1461 5.8319 3.4180 4.5539 11.0772 6.0251 5.0233 12.6551 13.0826 6.1682 5.5606 5.4370 4.3329 5.4027 3.0070 2.5816 1.2744 1.2645 2.4812 1.5480 1.4686 1.4086 1.8433 1.3631 2.2592 1.5841 1.1786 1.2072 1.0950 1.0492 1.0497 1.0502 1.0515 10.1432 9.1681 1.0633 1.0301 1.0289 1.0841 1.0962 1.1048 1.1053 1.1051 1.1055
irintensity: 0.9568 0.1211 0.7137 1.0075 1.0764 2.0761 0.0403 1.3021 2.5179 1.0857 1.5959 2.1129 3.0037 3.4942 2.3157 1.8983 1.5625 22.7089 22.5843 2.6138 13.7060 7.6885 21.3477 9.7880 9.2185 2.9434 18.6398 6.0052 0.2779 152.1162 14.6830 8.5675 141.1044 186.9912 5.8254 12.1543 4.6335 7.9623 20.2857 86.6652 17.7414 2.6618 0.1368 265.2991 76.2069 66.4935 48.9479 136.9489 42.2590 64.8229 66.3339 9.7543 21.8718 40.7758 13.5355 16.3748 15.6141 9.2331 152.8692 158.6875 5.7959 26.9283 32.9761 11.0554 1.4580 22.1329 18.0600 13.2640 14.0850
temp: 298.150 k
press: 1.00000 atm
elementType: 17 17 17 16 16 8 8 8 8 6 6 6 6 6 6 6 1 1 1 1 1 1 1 1 1
symmnumber: 1
zpe: 412638.4 jmol-1
zpe.correction: 0.157166 hartree
zpe.thermalcorrener: 0.177728 hartree
zpe.thermalcorrenthalpy: 0.178672 hartree
zpe.thermalcorrgfe: 0.103028 hartree
zpe.sumelectzpe: -2748.061468 hartree
zpe.sumelectthermal: -2748.040905 hartree
zpe.sumelectthermalent: -2748.039961 hartree
zpe.sumelectthermalfe: -2748.115606 hartree
dipole: -3.4017 1.2407 -2.9103
dipole: 4.6455
quadrupole: -118.9429 -117.2539 -132.4053
quadrupole: -1.8230 6.7629 6.3980
quadrupole: 3.9245 5.6135 -9.5379 -1.8230 6.7629 6.3980
hfenergy: -2748.2186338 hartree
pointgroup: C01 [X(C7H9Cl3O4S2)]
dipole: -1.3188824 0.5416243 -1.1435266 debye
dipolederiv: -0.2764481 -0.1328176 -0.1552793 0.0595068 -0.4884695 -0.3742487 -0.0239769 -0.323548 -0.522577 -0.368454 0.1336737 -0.1946617 0.3237588 -0.3080225 0.2528656 -0.3525992 0.2641683 -0.5384773 -0.7614962 -0.2980192 0.2373719 -0.1756957 -0.3086157 0.1146645 0.2915019 0.164639 -0.2399016 0.1804305 0.1983005 -0.052399 0.2941662 0.0719408 -0.034923 -0.2498178 -0.0794547 0.0581938 -0.1068258 0.1030303 -0.0612874 0.1616571 -0.1602049 -0.0382192 0.0074185 0.0130833 -0.1427404 -1.2477699 -0.5154198 -0.309728 -0.4843223 -0.6284885 -0.1196947 -0.5937996 -0.2722256 -0.6286622 -0.4674199 0.1916979 0.0704147 0.4114442 -1.4413686 0.0522992 0.0871609 0.0760904 -0.3578942 -0.7096953 -0.2506478 0.0323372 -0.1448504 -0.5438361 0.221277 -0.5809223 -0.0459032 -0.699369 -0.5706858 -0.1782294 0.222952 0.1643114 -0.823434 0.0516927 0.1675063 0.2666689 -0.4632974 0.14049 -0.1039669 0.1670322 -0.0858606 0.0458502 0.067823 0.6024996 0.1465637 0.0592598 -0.1684332 0.0634203 0.0425769 0.0068372 -0.1147075 -0.0603822 0.0324974 -0.08751 -0.0992145 1.1776016 0.4669277 0.3127848 0.2636198 0.7350523 -0.0887092 0.9622108 0.2692308 1.00854 0.6640134 0.0987503 -0.322854 -0.4592287 1.7318793 -0.127736 -0.3182364 -0.3481141 0.5050844 0.606471 0.2379228 0.0513515 0.260751 0.4307457 0.0498357 -0.0389815 -0.0069386 0.2079719 0.373733 -0.2232544 -0.009432 -0.1633702 0.5081006 0.0575235 -0.0482656 0.1389326 0.252793 1.3904198 0.1355248 0.1107286 -0.3791516 1.1651832 0.0286777 0.1052638 -0.0571823 1.3042153 0.0626141 0.0237853 0.0012169 -0.0122211 0.006847 -0.0352191 -0.0550672 -0.03894 0.0142837 0.0563663 -0.055152 0.0633633 -0.0594263 0.011089 0.035415 0.0689854 -0.0077046 0.1143181 0.0033174 0.0372383 -0.0762198 0.0771863 0.0928244 -0.0362466 -0.0843709 -0.0331758 0.0260528 0.0038662 -0.0534765 -0.0750105 -0.0353854 0.0986345 -0.0014608 -0.1224538 -0.0389324 -0.0390084 -0.0065144 -0.0083611 0.0239327 0.0144642 0.0210976 -0.0853685 0.1223703 -0.0376258 0.0232708 0.0029955 0.0514401 -0.0360988 -0.019321 -0.0927225 0.0304211 0.0290772 0.0959155 0.0908536 0.0498966 0.0677417 -0.0354281 0.0320782 0.0566819 0.0429387 0.0011538 -0.0581791 -0.0937739 -0.1161102 0.051381 -0.0375607 -0.0597176 0.0371524 -0.042832 -0.0342807 -0.0653401 0.0664194 0.0876373 -0.0414899 0.0298969 0.0087699 -0.1032092 0.0396063 0.0251258 0.0654817 0.0936595 unknown
polarizability: 211.0684557|18.0829932|149.7159315|-4.8625047|-6.0504181|128.5296655 unknown
InChI: InChI=1S/C7H9Cl3O4S2/c1-13-5(11)3-4(6(12)14-2)15-16-7(8,9)10/h4H,3H2,1-2H3
charge 0 multiplicity 1
25 atoms
Cl 3.188434 -1.50425 -1.368944
Cl 4.379856 -1.156005 1.382717
Cl 5.146082 0.765293 -0.845495
S  0.808482 -0.231804 1.269569
S  2.434603 1.030431 0.306789
O  -2.225085 -1.872371 -0.78074
O  -1.727682 2.748811 -0.494397
O  -1.358439 -2.046391 1.379216
O  -2.587428 0.89935 0.630041
C  -0.234227 -0.629569 -0.29796
C  -0.768513 0.617045 -1.0200
C  -1.320229 -1.570033 0.222628
C  -1.781924 1.393303 -0.191556
C  -3.37767 -2.715117 -0.367144
C  -2.70812 3.608987 0.218277
C  3.755576 -0.238836 -0.100885
H  0.431124 -1.188928 -0.977971
H  0.059571 1.278334 -1.323616
H  -1.280137 0.28123 -1.943612
H  -3.973843 -2.841487 -1.281043
H  -3.948107 -2.191054 0.417056
H  -3.020899 -3.684868 0.017128
H  -2.578377 3.506537 1.308209
H  -3.736407 3.319279 -0.055536
H  -2.47944 4.629412 -0.117734
