program: Gaussian 09
title: 000224481
version: EM64L-G09RevD.01
frameworkgroup: C1[X(C14H12ClNO)]
method: RPBEPBE
basis: SDD
operation: Freq
keyword: #p
keyword: freq=noraman
keyword: PBEPBE/SDD
title: #p freq=noraman PBEPBE/SDD
converged: YES YES NO NO
title: Mulliken charges:
elementType: Cl O N C C C C C C C C C C C C C C H H H H H H H H H H H H
charge: -0.041218 -0.253008 -0.282586 0.293736 0.354698 0.257646 -0.327503 -0.333904 -0.343795 -0.341148 -0.209179 -0.241454 -0.210394 -0.225932 -0.723237 -0.235249 -0.246615 0.275867 0.257456 0.266160 0.316024 0.236398 0.226179 0.235367 0.228448 0.303729 0.298700 0.234991 0.229823
chargesum: 0.00000
title: Mulliken charges with hydrogens summed into heavy atoms:
elementType: Cl O N C C C C C C C C C C C C C C
charge: -0.041218 -0.253008 -0.282586 0.293736 0.354698 0.257646 -0.051636 -0.076448 -0.077636 -0.025124 0.027219 -0.015275 0.024973 0.002516 -0.120808 -0.000258 -0.016792
polarizability: 2.05694323e+02 1.11681845e+01 1.75793374e+02 -7.40490111e-01 -5.66086354e+00 1.20340044e+02
1716.lowfreq: -12.4968 -7.3211 -3.0763 -0.0011 -0.0010 -0.0005 18.3187 36.3749 49.6760
frequency: 18.2583 36.3546 49.6200 70.9746 83.4935 96.0793 164.0444 191.2820 224.6561 276.1493 303.5968 356.0658 389.2825 406.2126 410.8042 432.8588 493.1575 523.9727 561.0521 590.3345 614.7517 615.8166 645.9202 694.0779 695.4870 702.6765 738.5852 769.2004 772.5668 845.7150 853.9612 870.8220 919.2554 925.7745 940.9868 958.2244 978.7178 980.8603 984.4966 990.3795 1000.5885 1002.5603 1024.5248 1033.6496 1076.6320 1095.1106 1107.4941 1173.1186 1173.8172 1177.0184 1183.3236 1204.1533 1252.8881 1256.3091 1294.9527 1309.3916 1334.1422 1375.2031 1379.1392 1433.1217 1436.7853 1443.7079 1477.7190 1479.2643 1577.4738 1587.2436 1592.8011 1604.2369 1611.5955 3085.5706 3129.3528 3133.3320 3140.1084 3141.8503 3153.5290 3160.7537 3165.1555 3176.1306 3176.5958 3176.9639 3211.5450
redmass: 4.2458 9.1198 6.4514 4.7208 5.0311 6.0079 9.7667 4.4610 4.7585 4.0941 5.1627 5.2678 4.1006 2.9247 2.8693 5.0824 4.1548 4.2554 4.1149 5.4125 6.3810 6.4149 6.9635 2.5361 3.6471 1.8399 6.5021 1.7358 1.8631 1.2531 1.2440 3.4783 1.5593 1.4152 1.8677 6.7111 1.3788 1.3716 5.7497 6.1139 1.3209 1.3072 2.0439 2.1950 1.5455 1.5356 1.3081 1.1918 1.0653 1.2844 1.4202 1.2688 3.2460 1.2455 3.9080 1.3398 1.5299 9.0392 8.6392 1.1288 2.1056 2.4207 2.2104 2.3188 7.1397 7.3230 6.4485 6.1193 6.2562 1.0563 1.0852 1.0854 1.0908 1.0890 1.0939 1.0966 1.0972 1.1004 1.1071 1.1002 1.0939
irintensity: 0.9257 0.7268 1.2061 0.5707 0.8672 0.6789 3.6204 2.4030 0.3018 1.6088 0.4178 2.3508 9.5548 0.1072 0.1357 2.5128 2.4773 14.9444 13.3178 40.7035 0.1160 0.2803 15.1067 19.4502 18.4298 53.7014 9.1435 68.0242 24.7067 1.7795 0.0691 9.8270 1.2721 6.2397 3.6972 2.4274 0.5105 0.4171 0.0257 2.2872 0.0888 2.3787 6.0036 16.2226 10.2450 3.9053 36.1967 3.5310 0.5369 2.9197 5.2403 2.1617 33.2243 6.6356 209.9590 0.5983 20.6228 1.7746 3.3440 26.9145 10.2438 19.8054 113.3553 22.8500 181.3991 89.7988 2.8911 30.6353 12.3896 9.7618 0.3514 0.4437 18.9836 4.5638 20.0383 34.4463 17.9791 4.4048 0.5305 11.0508 11.3850
temp: 298.150 k
press: 1.00000 atm
elementType: 17 8 7 6 6 6 6 6 6 6 6 6 6 6 6 6 6 1 1 1 1 1 1 1 1 1 1 1 1
symmnumber: 1
zpe: 584527.6 jmol-1
zpe.correction: 0.222635 hartree
zpe.thermalcorrener: 0.237311 hartree
zpe.thermalcorrenthalpy: 0.238256 hartree
zpe.thermalcorrgfe: 0.178293 hartree
zpe.sumelectzpe: -1129.531125 hartree
zpe.sumelectthermal: -1129.516449 hartree
zpe.sumelectthermalent: -1129.515505 hartree
zpe.sumelectthermalfe: -1129.575467 hartree
dipole: 1.2178 4.5047 0.7116
dipole: 4.7204
quadrupole: -98.1214 -107.7568 -102.4918
quadrupole: 4.9327 4.6095 -0.7008
quadrupole: 4.6686 -4.9668 0.2982 4.9327 4.6095 -0.7008
hfenergy: -1129.7537602 hartree
pointgroup: C01 [X(C14H12Cl1N1O1)]
dipole: -0.9810729 -1.4311336 0.662063 debye
polarizability: 207.2853219|5.1941382|170.102704|12.5774663|-11.2275212|124.4397157 unknown
InChI: InChI=1S/C14H12ClNO/c15-11-14(17)16(12-7-3-1-4-8-12)13-9-5-2-6-10-13/h1-10H,11H2
charge 0 multiplicity 1
29 atoms
Cl -1.824673 2.506424 -2.33072
O  0.888453 2.831087 -0.106139
N  0.081029 0.606762 -0.060164
C  -1.119116 -0.228514 -0.049511
C  1.355907 -0.070174 0.093329
C  -0.065692 2.001525 -0.192078
C  -1.618685 -0.768023 -1.255362
C  1.360937 -1.48652 0.245173
C  -1.756079 -0.507545 1.182445
C  2.600817 0.622691 0.083909
C  -2.776488 -1.578435 -1.228527
C  2.575279 -2.188817 0.381205
C  -2.914419 -1.316281 1.203488
C  3.806238 -0.098898 0.219284
C  -1.473357 2.531836 -0.465673
C  -3.426587 -1.851618 -0.00248
C  3.810216 -1.503122 0.369225
H  -1.108107 -0.545085 -2.1966
H  0.422336 -2.045784 0.252808
H  -1.33896 -0.097838 2.108903
H  2.6152 1.706586 -0.020158
H  -3.170625 -1.99032 -2.163552
H  2.550022 -3.27831 0.494662
H  -3.411818 -1.529735 2.155676
H  4.752454 0.453784 0.20816
H  -1.498757 3.593063 -0.188611
H  -2.292014 1.962884 -0.008205
H  -4.325035 -2.478073 0.014193
H  4.752627 -2.050946 0.474616
