program: Gaussian 09
title: 000224468
version: EM64L-G09RevD.01
frameworkgroup: C1[X(C6H9Cl2NO)]
method: RPBEPBE
basis: SDD
operation: Freq
keyword: #p
keyword: freq=noraman
keyword: PBEPBE/SDD
title: #p freq=noraman PBEPBE/SDD
converged: YES YES NO NO
title: Mulliken charges:
elementType: Cl Cl O N C C C C C C H H H H H H H H H
charge: -0.000700 0.075534 -0.224829 -0.317588 -0.394889 -0.329009 -0.350068 -0.484073 -0.405117 0.282421 0.225026 0.220178 0.259144 0.235149 0.210856 0.208274 0.218178 0.241238 0.330276
chargesum: 0.00000
title: Mulliken charges with hydrogens summed into heavy atoms:
elementType: Cl Cl O N C C C C C C
charge: -0.000700 0.075534 -0.224829 0.012688 0.050315 0.165284 0.069061 -0.484073 0.054299 0.282421
polarizability: 1.08821692e+02 4.64920955e+00 8.27889870e+01 -6.84923752e+00 -2.99078629e+00 7.84375880e+01
1716.lowfreq: -15.2539 -11.6441 -0.0012 0.0018 0.0020 12.1722 75.1121 126.9676 161.4222
frequency: 75.0785 126.9547 161.4148 194.2479 233.3511 261.3440 284.9745 304.3837 341.4728 391.8115 428.2227 459.1412 490.6274 570.0943 598.3571 707.4752 732.0561 759.9434 815.1050 879.1749 891.3761 927.5043 974.0350 1066.0610 1084.1650 1103.4858 1134.5331 1197.5288 1230.2187 1267.7730 1277.1405 1329.8991 1343.7481 1355.0056 1370.5260 1385.1885 1424.3282 1447.0941 1457.0405 1461.6133 1480.3308 1618.7168 2981.6603 2990.4699 2994.0780 2996.2417 3040.4337 3053.7629 3065.3748 3066.9218 3525.3710
redmass: 8.3485 3.2944 6.9211 4.7961 3.9501 6.7517 4.8221 4.5912 2.2390 3.5822 5.7658 3.7357 2.4741 2.1224 1.8179 3.4066 3.8363 3.1271 2.3492 2.2521 2.0086 2.6713 2.1529 2.4381 2.6277 2.2814 2.2171 1.4923 1.2514 1.2291 1.4938 1.4797 1.4790 1.4197 1.4570 1.6411 1.4398 1.0863 1.0882 1.0951 1.1083 5.8358 1.0602 1.0627 1.0644 1.0626 1.0999 1.0995 1.1005 1.1007 1.0760
irintensity: 1.6417 0.1686 1.6657 0.4954 0.2784 1.1288 0.3849 1.7523 0.3395 3.9498 7.8503 19.0220 7.3207 14.9704 76.8290 86.9461 5.6786 62.5914 9.2886 29.8309 16.6242 6.6463 28.4515 2.4871 13.2700 12.4037 4.9046 1.1099 1.2131 15.5455 16.6009 51.6981 9.2542 3.6720 2.4000 21.5410 4.5709 12.2618 9.2175 20.2826 20.9833 241.0212 26.6373 12.2243 24.8584 29.1544 30.1553 36.3812 8.5922 34.0403 29.7252
temp: 298.150 k
press: 1.00000 atm
elementType: 17 17 8 7 6 6 6 6 6 6 1 1 1 1 1 1 1 1 1
symmnumber: 1
zpe: 384939.5 jmol-1
zpe.correction: 0.146616 hartree
zpe.thermalcorrener: 0.156555 hartree
zpe.thermalcorrenthalpy: 0.157499 hartree
zpe.thermalcorrgfe: 0.111111 hartree
zpe.sumelectzpe: -1283.355396 hartree
zpe.sumelectthermal: -1283.345457 hartree
zpe.sumelectthermalent: -1283.344512 hartree
zpe.sumelectthermalfe: -1283.390901 hartree
dipole: -5.7472 -1.6494 -0.9047
dipole: 6.0473
quadrupole: -71.2633 -75.1398 -72.9725
quadrupole: -6.7084 -0.3984 3.6631
quadrupole: 1.8619 -2.0146 0.1527 -6.7084 -0.3984 3.6631
hfenergy: -1283.5020118 hartree
pointgroup: C01 [X(C6H9Cl2N1O1)]
dipole: 2.3632459 0.2231285 -0.1604552 debye
dipolederiv: -0.2311593 0.0083843 -0.0569733 0.0088131 -0.243847 -0.0943572 -0.0842644 -0.0743398 -0.7123486 -0.6065102 0.0995841 -0.1570507 0.1530733 -0.1430713 0.0713391 -0.1039355 0.0425546 -0.1987917 -0.9157234 -0.0988005 -0.147412 -0.3279412 -0.6899561 -0.1708177 -0.2374663 -0.0807189 -0.3658672 -1.0087161 -0.0516863 -0.0675865 0.4133296 -0.3807099 0.1156426 -0.018919 0.0259625 -0.444979 0.0834649 0.0006992 -0.0216091 -0.0525237 0.0932446 0.0159436 0.069661 0.0155135 0.0953355 -0.1165004 0.0373818 -0.0023729 0.0480008 -0.0747786 -0.0051547 0.013857 0.0282335 -0.0789658 0.026677 -0.0109023 -0.0011608 -0.0187623 0.0322674 0.0392909 -0.0072639 0.0699355 0.1009178 0.8825778 -0.1567317 0.2020889 -0.0819647 0.1668586 -0.0779123 0.1536036 -0.0659469 1.0292917 0.4985587 0.1219884 0.0393085 0.1567493 0.2163552 0.0216735 0.0625357 0.020612 0.2627696 1.3256737 0.0398579 0.253417 -0.23993 0.8991613 0.1985122 0.2881047 0.1710428 0.1344252 0.0559197 0.0371929 -0.0004724 0.0392109 0.0445588 -0.043136 -0.0560624 -0.0974106 -0.0902192 -0.0309201 -0.0646757 0.0565703 -0.0687202 -0.062821 0.0981599 0.0675632 0.1223341 0.015794 0.0272906 0.04858 -0.0020781 0.0503757 -0.0797561 0.0079919 0.0093382 -0.0069049 0.0983575 0.0354715 -0.0232082 0.0226661 -0.0511071 0.0762338 -0.0349787 -0.0131338 -0.0449059 -0.0819263 0.0977441 -0.0031368 -0.0292188 0.0257456 -0.0034739 -0.0576311 0.0404638 -0.06039 -0.1380978 -0.1968463 -0.0167378 -0.0452931 -0.0459438 0.0439562 0.0011917 -0.0801252 0.0089861 0.0696378 -0.0469 0.0783596 -0.0335891 0.1096815 -0.1069416 0.0354231 0.0015675 -0.0032277 0.099728 0.0225494 -0.038579 0.0436236 -0.0931608 0.0610397 -0.0910531 -0.0337454 -0.0421274 -0.0887443 0.0973482 -0.0075699 -0.0528576 -0.024926 0.1516798 -0.0301276 -0.0717786 -0.0292026 0.2936828 unknown
polarizability: 108.5004313|-2.5891175|81.357693|8.9805687|1.869651|80.1901431 unknown
InChI: InChI=1S/C6H9Cl2NO/c7-6(8)3-1-2-4-9-5(6)10/h9H,1-4H2
charge 0 multiplicity 1
19 atoms
Cl -0.674552 0.857379 1.911963
Cl -2.556857 1.036642 -0.456256
O  -1.67506 -1.720043 -0.59081
N  0.528689 -1.600453 0.060061
C  1.632697 1.423798 -0.2935
C  0.153256 1.416673 -0.744732
C  2.376202 0.075444 -0.380585
C  -0.82725 0.519356 0.031921
C  1.793668 -1.010874 0.548508
C  -0.703936 -1.02359 -0.183901
H  1.685613 1.804479 0.74422
H  2.154797 2.164535 -0.929334
H  -0.233923 2.449169 -0.679534
H  0.074937 1.111579 -1.808128
H  2.380594 -0.30223 -1.421857
H  3.432658 0.241241 -0.091565
H  2.510759 -1.846959 0.626629
H  1.65382 -0.597676 1.565699
H  0.513685 -2.61187 -0.097299
