program: Gaussian 09
title: 000224466
version: EM64L-G09RevD.01
frameworkgroup: C1[X(C7H4BrClO3)]
method: RPBEPBE
basis: SDD
operation: Freq
keyword: #p
keyword: freq=noraman
keyword: PBEPBE/SDD
title: #p freq=noraman PBEPBE/SDD
converged: NO YES NO NO
title: Mulliken charges:
elementType: Br Cl O O O C C C C C C C H H H H
charge: 0.036789 -0.037611 -0.355492 -0.454085 -0.205844 0.174022 0.267145 -0.224742 -0.268199 -0.217998 -0.183530 0.127132 0.306803 0.281781 0.364073 0.389757
chargesum: 0.00000
title: Mulliken charges with hydrogens summed into heavy atoms:
elementType: Br Cl O O O C C C C C C C
charge: 0.036789 -0.037611 0.008581 -0.064328 -0.205844 0.174022 0.267145 0.082061 -0.268199 -0.217998 0.098251 0.127132
polarizability: 1.62302943e+02 -3.88036856e+00 1.38246160e+02 1.16231823e-02 1.27183638e-03 3.95886852e+01
1716.lowfreq: 0.0008 0.0017 0.0023 4.2021 5.6797 6.5082 34.2531 84.3949 114.1475
frequency: 34.2122 84.3939 114.1466 128.1579 165.9530 191.8875 263.3778 294.3785 325.1633 334.2892 377.3804 407.0233 452.8791 494.0895 551.1823 561.1645 587.3837 613.4748 669.0160 680.0696 762.1622 782.1753 830.1543 875.2598 932.2395 995.6902 1091.7798 1125.9898 1160.4506 1227.8082 1286.2105 1299.0673 1372.5932 1388.9218 1447.8756 1568.6897 1587.7355 1653.4819 3184.2209 3200.5069 3458.6258 3534.9438
redmass: 12.7031 9.5951 8.8213 13.1385 19.6004 4.7094 17.8304 8.1586 8.0934 10.4133 8.9956 8.7902 3.5552 1.1285 3.9209 4.4958 1.2637 5.6835 10.2188 5.9808 6.7123 7.2464 7.7445 1.3987 1.4147 4.8051 1.8713 3.2706 1.4919 1.8556 1.9070 2.2735 3.9832 5.7082 3.9735 7.4769 7.5679 9.1963 1.0936 1.0928 1.0646 1.0643
irintensity: 1.1683 0.1117 0.1241 0.2025 0.0496 1.0698 0.0283 9.8030 1.9100 1.3139 0.8186 5.4983 11.8176 108.0072 22.0865 42.4605 169.8451 40.3811 115.9504 9.7079 20.1545 24.2536 6.0615 20.3383 8.9557 178.6915 84.7203 151.4406 109.9465 74.4605 19.9293 90.2590 120.5919 4.4325 132.6314 30.1904 8.1365 273.4826 1.0749 5.1325 76.9855 51.0624
temp: 298.150 k
press: 1.00000 atm
elementType: 35 17 8 8 8 6 6 6 6 6 6 6 1 1 1 1
symmnumber: 1
zpe: 251791.2 jmol-1
zpe.correction: 0.095902 hartree
zpe.thermalcorrener: 0.107200 hartree
zpe.thermalcorrenthalpy: 0.108144 hartree
zpe.thermalcorrgfe: 0.056526 hartree
zpe.sumelectzpe: -967.473235 hartree
zpe.sumelectthermal: -967.461937 hartree
zpe.sumelectthermalent: -967.460993 hartree
zpe.sumelectthermalfe: -967.512611 hartree
dipole: 0.8940 0.8375 0.0034
dipole: 1.2251
quadrupole: -93.3843 -72.7360 -86.2641
quadrupole: -3.7819 -0.0199 -0.0011
quadrupole: -9.2561 11.3921 -2.1360 -3.7819 -0.0199 -0.0011
hfenergy: -967.569137 hartree
pointgroup: C01 [X(C7H4Br1Cl1O3)]
dipole: 0.4812617 0.0222442 -0.01377 debye
dipolederiv: -0.2934765 -0.3037748 0.0048904 -0.3204009 -0.4409313 0.0049632 0.0047482 0.0044908 -0.0137606 -0.2452675 0.2086474 0.0071249 0.1957215 -0.6791696 -0.0102534 0.0069994 -0.0106003 -0.0359647 -0.3670086 -0.5949986 -0.0047769 -0.4436804 -1.0698113 0.006016 -0.0034254 0.0099467 -0.3546875 -0.528308 0.358584 0.0046421 0.4982891 -1.1471693 -0.0174585 0.0051732 -0.0134565 -0.4347889 -1.0347297 -0.2426325 0.0180676 -0.0973784 -0.6034542 0.0011691 0.0183847 0.0046943 -0.3055522 -0.718269 0.277285 0.020781 -0.1026931 -0.0666683 0.0023938 0.0178868 -0.0077689 -0.0093824 0.3341985 0.7197161 0.0002828 0.4307078 0.7018589 -0.0064838 -0.0017239 -0.0140357 0.1200833 0.0919654 -0.3079949 -0.0059989 0.0038353 -0.2505049 -0.0017971 -0.0036956 0.0063519 -0.0423745 0.112535 -0.7013092 -0.0112718 -0.3831134 0.8173501 0.0172585 -0.0087292 0.0257162 -0.1017989 0.2966697 0.758366 -0.0060199 0.7714542 0.660451 -0.0135567 -0.0058984 -0.0132145 -0.1660708 -0.1531435 -0.0449074 0.0036968 -0.1876884 -0.1759761 0.0035051 0.0025838 -0.0002568 0.0029579 1.873306 -0.2537178 -0.045173 -0.3480473 1.3747633 0.0154843 -0.0451601 0.0133077 0.242134 0.1625889 0.0208009 0.0001967 0.0147532 0.0635743 -0.0011965 0.0002597 -0.0013051 0.1626459 0.0288628 0.013306 0.0036441 0.0173056 0.1163772 -0.0008319 0.0036554 -0.0007244 0.1632106 0.2931001 0.14929 0.0034812 0.0931454 0.3670824 -0.0025664 0.0028972 -0.0041273 0.3709715 0.1469763 -0.05666 0.0064329 -0.1422104 0.3322277 0.0033544 0.0060443 0.0009819 0.4023774 unknown
polarizability: 146.0013335|11.9380761|154.4722414|-2.7002282|0.5892809|39.6642134 unknown
InChI: InChI=1S/C7H4BrClO3/c8-3-1-4(7(11)12)6(10)5(9)2-3/h1-2,10-11H
charge 0 multiplicity 1
16 atoms
Br 2.726128 2.738802 -0.018419
Cl 1.93302 -2.902639 -0.042755
O  -1.010506 -2.181041 0.04011
O  -2.495059 1.847334 0.108771
O  -3.107567 -0.390393 0.11129
C  -0.72347 0.23953 0.052228
C  -0.175584 -1.0802 0.027182
C  0.15151 1.360592 0.038095
C  1.241388 -1.208574 -0.011217
C  1.541687 1.180264 0.000028
C  2.111622 -0.111686 -0.025347
C  -2.196457 0.464917 0.092867
H  -0.28933 2.3585 0.057544
H  3.193833 -0.258876 -0.054991
H  -0.471465 -3.019544 0.018368
H  -3.484049 1.948215 0.135548
