program: Gaussian 09
title: 000224448
version: EM64L-G09RevD.01
frameworkgroup: C1[X(C19H26O2)]
method: RPBEPBE
basis: SDD
operation: Freq
keyword: #pfreq=noraman
keyword: PBEPBE/SDD
title: #p freq=noraman PBEPBE/SDD
converged: YES YES NO NO
title: Mulliken charges:
elementType: O O C C C C C C C C C C C C C C C C C C C H H H H H H H H H H H H H H H H H H H H H H H H H H
charge: -0.179128 -0.196717 0.429533 -0.216647 -0.294712 0.320436 0.403652 -0.136227 -0.506885 -0.532372 -0.524102 -0.514380 -0.480543 -0.466872 0.045792 -0.583698 -0.877098 -0.505219 -0.788947 -0.532092 0.177680 0.210296 0.220901 0.241283 0.239376 0.219452 0.209778 0.237000 0.215659 0.225067 0.230830 0.219468 0.216400 0.219006 0.227566 0.219212 0.242260 0.220765 0.243048 0.227480 0.247662 0.246991 0.240496 0.227750 0.238846 0.242815 0.229139
chargesum: 0.00000
title: Mulliken charges with hydrogens summed into heavy atoms:
elementType: O O C C C C C C C C C C C C C C C C C C C
charge: -0.179128 -0.196717 0.429533 -0.006351 -0.073811 0.320436 0.403652 0.105057 -0.048057 -0.085594 -0.083375 -0.064082 -0.045137 -0.239306 0.045792 -0.122226 -0.185805 -0.010567 -0.081855 -0.060138 0.177680
polarizability: 2.45651089e+02 6.82634263e+00 1.90329912e+02 8.99638772e-01 2.81263643e+00 1.52237197e+02
1716.lowfreq: -9.1205 0.0007 0.0009 0.0010 5.9008 9.2697 36.1152 51.3160 65.9905
frequency: 36.0154 51.3069 65.9884 107.1141 125.3460 142.8354 149.9531 170.5864 187.0575 216.8153 226.3122 235.9141 256.1450 265.6594 280.8916 289.3896 304.2065 327.0769 355.1169 376.5155 391.6694 407.9936 422.3105 425.0640 473.0133 496.8813 510.9723 519.8768 541.1952 547.8485 580.2236 584.5333 609.8474 665.6369 688.0789 713.1248 726.6537 759.6655 803.7529 814.5227 822.6508 827.4608 846.9302 854.9866 888.3120 910.1158 924.9713 936.0578 946.5231 959.5035 974.9062 977.6061 986.3057 1010.8994 1013.6527 1017.8939 1033.2450 1051.0574 1054.3511 1074.6806 1092.4097 1094.9221 1103.8371 1128.1719 1137.3532 1139.9616 1144.4149 1154.3156 1172.7483 1187.6021 1188.6820 1205.4088 1225.0518 1228.8949 1241.4569 1253.2329 1255.3077 1260.3854 1264.9926 1277.2188 1287.4008 1293.7384 1296.5397 1300.8260 1320.1572 1321.7751 1332.9755 1333.3546 1342.5418 1348.7529 1355.3478 1366.2896 1379.4612 1388.5047 1429.3947 1437.9101 1445.4806 1461.1490 1461.7466 1463.6169 1468.3010 1472.0582 1482.1937 1487.1760 1493.2389 1494.9988 1634.2175 1655.0651 1686.0896 2883.8375 2898.4267 2943.6000 2953.8533 2968.6835 2971.3484 2977.8608 2978.7226 2982.4008 2983.1104 2998.7292 2998.9921 2999.1932 3008.2567 3038.5692 3042.7423 3056.8492 3057.8001 3058.4544 3068.0663 3071.0118 3072.2525 3075.9485 3077.5349 3086.6844 3104.3899
redmass: 4.6589 4.9492 5.5344 2.9367 4.9047 2.0998 1.4669 2.6346 2.3652 3.6984 2.3286 1.6278 2.0812 3.4171 1.9700 2.4401 2.5562 2.8776 2.9353 2.2554 2.6442 3.4279 3.1369 2.5780 4.1416 2.4543 3.4765 3.3164 2.5677 2.3358 3.7480 3.5993 3.2623 3.9589 2.5468 3.4634 2.5451 2.0520 2.3736 2.5719 1.8539 1.9723 1.5870 1.9759 2.3459 2.0481 1.8415 1.8266 1.6418 1.9104 1.9637 2.0786 2.0252 1.9970 2.1875 2.0948 1.8859 2.2104 2.5501 2.6748 1.7750 2.1975 1.9172 1.6672 1.9090 1.9746 1.8978 1.7370 1.6209 2.0221 1.4851 1.4960 1.8021 1.9204 2.0700 1.4986 1.4851 1.5516 1.5308 1.5341 1.5465 1.3258 1.3991 1.4154 1.5651 1.4758 1.3421 1.5323 1.5619 1.4903 1.4186 1.7895 1.1965 1.2147 1.0802 1.0891 1.0847 1.0709 1.0752 1.0743 1.0831 1.0879 1.0707 1.0737 1.0548 1.0592 9.3286 12.0213 7.7561 1.0798 1.0808 1.0706 1.0724 1.0651 1.0642 1.0615 1.0612 1.0374 1.0366 1.0619 1.0805 1.0754 1.0638 1.0982 1.0985 1.0960 1.0987 1.1010 1.0974 1.0980 1.1003 1.0994 1.0997 1.1006 1.0902
irintensity: 1.4779 4.7688 1.5272 3.8414 1.9927 1.0722 0.5562 0.9829 0.1190 0.5145 0.3838 0.2357 0.0283 2.2537 2.7597 0.0547 0.8635 2.9638 0.8947 0.9533 2.7952 1.3151 0.7434 2.1770 3.7761 0.7142 1.4135 3.4390 0.2865 2.8881 1.6461 3.4577 1.5731 5.7262 0.5714 0.8627 2.6973 5.8673 3.3212 4.6134 10.4577 11.5469 16.8017 1.6962 2.4783 1.5817 4.4077 2.9748 1.8962 2.5674 12.0749 2.9973 6.0886 15.3787 40.9324 1.7362 8.0007 10.8831 13.7942 3.5103 2.5499 2.7883 3.7097 17.7668 12.3310 0.9111 0.9182 15.2118 26.1232 3.3978 4.6823 1.4552 19.0124 9.2047 11.8466 15.4597 2.6051 5.9597 2.1769 8.1816 1.1053 0.3325 1.9072 3.0651 1.3260 8.2351 3.1108 0.3854 1.5430 1.3570 2.4834 1.9377 12.9686 30.6005 17.9299 18.5953 10.1303 10.6334 12.8370 12.8318 8.3330 7.5487 4.3959 4.9795 13.8556 1.3735 224.2794 190.2668 5.0600 14.6050 28.9008 20.6629 18.8409 10.3908 38.5310 42.2971 10.2937 33.5981 4.7069 20.2144 10.2896 49.7340 16.8642 16.0845 44.3097 20.6739 10.1804 36.2982 55.4581 22.9961 31.9579 19.2114 25.9540 17.4458 30.9467
temp: 298.150 k
press: 1.00000 atm
elementType: 8 8 6 6 6 6 6 6 6 6 6 6 6 6 6 6 6 6 6 6 6 1 1 1 1 1 1 1 1 1 1 1 1 1 1 1 1 1 1 1 1 1 1 1 1 1 1
symmnumber: 1
zpe: 1066585.7 jmol-1
zpe.correction: 0.406241 hartree
zpe.thermalcorrener: 0.425497 hartree
zpe.thermalcorrenthalpy: 0.426441 hartree
zpe.thermalcorrgfe: 0.360303 hartree
zpe.sumelectzpe: -888.462061 hartree
zpe.sumelectthermal: -888.442805 hartree
zpe.sumelectthermalent: -888.441861 hartree
zpe.sumelectthermalfe: -888.507999 hartree
dipole: -0.8023 1.4554 1.9613
dipole: 2.5707
quadrupole: -174.2403 -123.1981 -125.5297
quadrupole: -14.9682 7.9071 -0.8156
quadrupole: -33.2509 17.7913 15.4597 -14.9682 7.9071 -0.8156
hfenergy: -888.8683019 hartree
pointgroup: C01 [X(C19H26O2)]
dipole: 0.313661 -0.5625461 0.7797949 debye
polarizability: 245.6944331|6.6371614|190.199188|-0.9829077|-3.3494173|152.3245772 unknown
InChI: InChI=1S/C19H26O2/c1-18-9-7-13(20)11-12(18)3-4-14-15-5-6-17(21)19(15,2)10-8-16(14)18/h4,12,15-16H,3,5-11H2,1-2H3
charge 0 multiplicity 1
47 atoms
O  5.099844 1.211168 -0.522617
O  -5.657887 -0.142256 -1.029886
C  -1.658907 0.448498 0.22365
C  -0.195694 0.503194 -0.363994
C  2.059233 -0.685181 -0.507496
C  2.778778 0.550087 0.119201
C  0.606206 -0.7857 -0.092842
C  -2.254074 -0.963674 -0.114139
C  0.578858 1.797477 0.064959
C  2.069902 1.829492 -0.365034
C  -2.528497 1.528116 -0.489821
C  3.053994 -1.854711 -0.298519
C  -1.456192 -2.091931 0.579015
C  0.032405 -1.938461 0.345636
C  4.225709 0.327184 -0.35915
C  -3.770932 -1.08435 0.207234
C  -1.653886 0.686812 1.759674
C  4.426987 -1.18811 -0.60408
C  2.838647 0.482475 1.677676
C  -4.036944 1.454282 -0.129841
C  -4.596958 0.056959 -0.379086
H  -0.301088 0.565347 -1.473808
H  2.046115 -0.480834 -1.606334
H  -2.136326 -1.100198 -1.211473
H  0.533571 1.908826 1.162783
H  0.064424 2.679464 -0.361058
H  2.147592 1.892202 -1.469352
H  2.562167 2.732196 0.042498
H  -2.422328 1.405648 -1.587568
H  -2.156087 2.540445 -0.244122
H  2.846316 -2.711673 -0.962341
H  3.015886 -2.224291 0.742761
H  -1.791418 -3.074852 0.189869
H  -1.687856 -2.109446 1.666192
H  0.658608 -2.828542 0.495735
H  -3.911908 -1.077447 1.30898
H  -4.173242 -2.043476 -0.165571
H  -2.614504 0.398155 2.222735
H  -0.858737 0.099558 2.253054
H  -1.487186 1.751973 1.999512
H  4.718085 -1.321747 -1.664315
H  5.268657 -1.569902 0.001092
H  1.830338 0.348444 2.106313
H  3.461538 -0.356893 2.035992
H  3.27568 1.416631 2.072945
H  -4.624939 2.185122 -0.711616
H  -4.171552 1.696117 0.944457
