program: Gaussian 09
title: 000217948
version: EM64L-G09RevD.01
frameworkgroup: C1[X(C13H13N3O2)]
method: RPBEPBE
basis: SDD
operation: Freq
keyword: #p
keyword: freq=noraman
keyword: PBEPBE/SDD
title: #p freq=noraman PBEPBE/SDD
converged: YES YES NO NO
title: Mulliken charges:
elementType: O O N N N C C C C C C C C C C C C C H H H H H H H H H H H H H
charge: -0.276772 -0.250125 -0.304520 -0.422395 -0.227437 0.052105 -0.495753 0.280348 -0.386223 0.119519 0.205394 0.414977 -0.606169 -0.394873 -0.327993 -0.215878 -0.214945 -0.237548 0.247912 0.245441 0.232923 0.233120 0.329271 0.272859 0.244650 0.241735 0.272103 0.265090 0.233955 0.234213 0.235016
chargesum: 0.00000
title: Mulliken charges with hydrogens summed into heavy atoms:
elementType: O O N N N C C C C C C C C C C C C C
charge: -0.276772 -0.250125 -0.304520 -0.093124 -0.227437 0.052105 -0.002400 0.280348 0.079819 0.119519 0.205394 0.414977 0.153076 -0.122770 -0.062903 0.018077 0.019268 -0.002531
polarizability: 2.33274971e+02 3.63944358e+00 1.65802943e+02 -2.49972169e+00 1.23319982e+01 1.04645413e+02
1716.lowfreq: -6.3557 -2.5649 -0.0005 -0.0003 0.0002 7.6876 45.2745 51.3618 77.8565
frequency: 45.2687 51.3582 77.8506 88.3081 113.8141 116.1625 128.6536 169.7557 223.3644 230.8893 263.6007 276.1766 304.2260 346.2127 377.9269 387.4783 408.6583 427.4876 443.7132 474.4975 508.3228 592.6853 612.6189 639.5133 657.3982 692.5409 695.8760 713.5013 730.8694 749.0970 785.2286 840.5119 844.3750 852.3063 903.5430 925.0608 957.9852 973.2284 980.7956 989.9264 996.2818 1024.9324 1029.0430 1054.6218 1078.6392 1097.1352 1128.5355 1129.4553 1170.7839 1174.1862 1185.3314 1207.6851 1226.4887 1248.7966 1274.0322 1288.5446 1301.9062 1316.5290 1349.3457 1374.1187 1382.5638 1422.8771 1439.5054 1475.1463 1476.5070 1477.5349 1482.8631 1491.3175 1539.4047 1580.3567 1596.9087 1609.1620 1638.8960 1654.6320 2981.1698 2998.4466 3005.6585 3050.5410 3068.7199 3096.5057 3131.5669 3133.0489 3143.0229 3154.9419 3167.0392 3181.1714 3593.0560
redmass: 5.8446 4.1636 4.3702 2.3257 1.8301 3.5112 1.5636 7.5646 4.1712 5.0070 4.5527 4.8930 5.0810 3.8144 1.3656 8.4541 2.8940 3.5517 5.5688 7.5896 3.6418 8.6834 6.4005 6.9556 6.3368 5.6036 2.5906 3.6860 8.0480 2.1497 2.8739 1.8418 1.3539 2.8582 2.9737 1.7719 3.0697 1.3822 2.8357 4.9746 1.3886 2.1879 3.4968 1.6057 1.8335 3.1189 3.5052 1.3588 1.1780 1.0522 1.1148 1.2548 2.4355 1.8942 3.4237 2.1530 1.6607 1.3900 2.5815 2.7826 8.7415 1.3088 2.2259 1.1168 1.0492 1.0916 2.2424 1.1933 3.5511 7.8002 6.6535 6.3650 9.3720 10.5266 1.0643 1.0669 1.0327 1.0969 1.1023 1.1022 1.1020 1.0853 1.0891 1.0942 1.0984 1.0985 1.0794
irintensity: 0.7486 0.7496 1.1095 5.9564 0.2186 4.5930 0.2997 2.8169 7.9713 0.7644 5.4557 0.0866 11.3274 10.3386 91.8804 16.9689 2.4467 15.6143 19.2476 9.9665 23.8221 2.4876 0.6942 4.1366 10.7471 9.4596 21.9190 5.2872 22.1070 43.4921 19.0074 1.0965 0.6416 7.9941 1.1134 1.5605 2.5926 1.5478 86.0626 4.3619 0.0541 6.0155 0.4736 3.0115 9.3770 9.5193 11.6150 0.9393 2.8401 0.0230 0.3794 2.4811 12.2438 42.2011 36.3518 105.0188 96.7881 11.0884 0.2378 54.7184 3.8356 85.0035 17.8292 19.7846 16.1907 26.2818 48.3602 41.2512 364.0743 24.0929 13.7440 65.1671 254.2727 843.4020 69.3060 40.2966 35.9606 25.5357 33.6401 20.7939 0.7196 0.9515 7.5816 22.7879 19.3868 3.0674 61.9769
temp: 298.150 k
press: 1.00000 atm
elementType: 8 8 7 7 7 6 6 6 6 6 6 6 6 6 6 6 6 6 1 1 1 1 1 1 1 1 1 1 1 1 1
symmnumber: 1
zpe: 635395.0 jmol-1
zpe.correction: 0.242009 hartree
zpe.thermalcorrener: 0.257591 hartree
zpe.thermalcorrenthalpy: 0.258535 hartree
zpe.thermalcorrgfe: 0.198744 hartree
zpe.sumelectzpe: -816.631238 hartree
zpe.sumelectthermal: -816.615656 hartree
zpe.sumelectthermalent: -816.614712 hartree
zpe.sumelectthermalfe: -816.674503 hartree
dipole: 4.7380 4.9077 -0.9055
dipole: 6.8815
quadrupole: -111.2829 -97.8142 -100.5905
quadrupole: 2.0328 -0.1814 2.7385
quadrupole: -8.0537 5.4150 2.6387 2.0328 -0.1814 2.7385
hfenergy: -816.8732472 hartree
pointgroup: C01[X(C13H13N3O2)]
dipole: -1.7760701 1.9907625 0.4607847 debye
polarizability: 232.8267722|-6.4754588|167.4251998|-3.009722|-8.7701346|103.4713554 unknown
InChI: InChI=1S/C13H13N3O2/c1-15-12(17)10-7-8-14-11(10)16(13(15)18)9-5-3-2-4-6-9/h2-6,14H,7-8H2,1H3
charge 0 multiplicity 1
31 atoms
O  4.013053 -0.587542 -0.122127
O  -0.271084 -2.550108 -0.229147
N  -0.1396 -0.208992 -0.00319
N  0.232782 2.198006 0.296183
N  1.849435 -1.559481 -0.171352
C  2.071321 0.832117 0.100249
C  2.648306 2.230507 0.239126
C  0.68476 0.904084 0.125469
C  1.385407 3.102946 0.577162
C  2.755756 -0.409926 -0.068899
C  0.451253 -1.518726 -0.139948
C  -1.585247 -0.079136 -0.018006
C  2.452649 -2.901313 -0.327611
C  -2.196825 0.749115 -0.990166
C  -2.370802 -0.775568 0.928896
C  -3.601748 0.899337 -0.995137
C  -3.774433 -0.629837 0.907579
C  -4.393315 0.211265 -0.047118
H  3.413128 2.294594 1.031425
H  3.126771 2.562257 -0.701135
H  1.37972 3.406584 1.642506
H  1.323758 4.012581 -0.044687
H  -0.736641 2.437979 0.49619
H  3.543491 -2.759446 -0.343689
H  2.108405 -3.367766 -1.265624
H  2.158944 -3.5537 0.511615
H  -1.580812 1.248957 -1.745171
H  -1.886686 -1.435129 1.653829
H  -4.075021 1.537825 -1.748869
H  -4.384626 -1.175438 1.635103
H  -5.483098 0.320453 -0.058555
