program: Gaussian 09
title: 000217947
version: EM64L-G09RevD.01
frameworkgroup: C1[X(C8H11N3O2)]
method: RPBEPBE
basis: SDD
operation: Freq
keyword: #p
keyword: freq=noraman
keyword: PBEPBE/SDD
title: #p freq=noraman PBEPBE/SDD
converged: NO NO NO NO
title: Mulliken charges:
elementType: O O N N N C C C C C C C C H H H H H H H H H H H
charge: -0.280444 -0.281722 -0.449361 -0.186954 -0.226493 0.056620 -0.496946 0.318877 -0.373868 0.137710 0.232722 -0.652367 -0.603592 0.247892 0.247901 0.234384 0.234433 0.320304 0.233289 0.233216 0.296889 0.242503 0.242289 0.272718
chargesum: 0.00000
title: Mulliken charges with hydrogens summed into heavy atoms:
elementType: O O N N N C C C C C C C C
charge: -0.280444 -0.281722 -0.129057 -0.186954 -0.226493 0.056620 -0.001153 0.318877 0.094950 0.137710 0.232722 0.111026 0.153918
polarizability: 1.42284733e+02 3.51523081e+00 1.33356233e+02 -2.51184238e-02 -8.06581590e-03 6.33483382e+01
1716.lowfreq: -50.0861 -11.6403 -0.0005 -0.0002 0.0001 1.6003 11.5022 90.6142 112.9057
frequency: -49.7216 90.6047 112.9029 128.8185 145.2672 159.3944 165.6943 236.1332 258.5355 278.7676 305.6850 325.3866 355.2926 390.5516 427.5601 477.0923 516.6505 640.9749 641.0954 695.3068 725.3336 726.2286 763.6118 830.0824 875.3651 926.3110 957.0301 1025.5876 1030.0167 1054.1725 1059.0888 1125.8902 1129.3898 1174.7638 1196.2151 1216.7035 1226.4162 1229.7703 1260.9443 1294.6958 1307.1717 1347.9197 1375.3088 1418.1687 1429.2757 1474.8207 1476.9642 1477.8119 1481.2892 1495.6168 1496.4266 1555.2395 1591.6904 1638.4636 1660.0957 2977.3433 2990.8535 3004.2692 3008.6864 3034.8310 3060.3064 3061.6696 3094.4684 3116.8552 3130.6761 3623.1430
redmass: 1.8141 4.0325 4.3355 1.1209 3.3419 1.2235 3.2098 1.3901 3.7953 4.7488 2.8320 2.4687 4.2128 8.4816 6.7355 8.1558 5.9303 7.4635 6.1318 8.9402 5.6600 8.3302 5.6956 1.2203 4.6146 3.1203 3.2699 3.6359 3.4028 1.5895 2.9958 1.2920 1.3038 1.1668 2.3545 1.0779 2.1806 2.4880 2.8261 1.6885 2.7220 2.5753 2.5008 1.2677 1.2736 1.1219 1.0541 1.0515 1.0822 1.0442 1.1293 4.7158 6.5564 8.9813 10.3233 1.0354 1.0578 1.0330 1.0604 1.1078 1.1032 1.1056 1.1021 1.0971 1.1018 1.0796
irintensity: 16.1299 0.0000 3.1538 0.0219 0.0897 15.1482 5.1092 92.0054 2.8562 0.0090 1.5292 18.2414 11.6449 22.4665 11.2622 16.9965 0.8007 0.6333 11.0372 1.0177 3.2733 30.7068 0.1191 0.7080 4.8979 41.5657 31.3933 31.7727 5.9357 0.1601 8.7687 0.1053 0.0784 1.1913 71.6875 0.1286 2.8011 31.7361 9.8888 15.9605 127.4031 14.7865 32.9309 40.2493 74.7701 14.6309 9.5061 10.4917 34.0077 19.3389 23.7901 466.0542 52.6971 234.2442 717.9739 53.6910 52.1528 41.9054 59.8021 4.7998 14.3652 57.0103 22.3162 1.0635 0.7332 63.4546
temp: 298.150 k
press: 1.00000 atm
elementType: 8 8 7 7 7 6 6 6 6 6 6 6 6 1 1 1 1 1 1 1 1 1 1 1
symmnumber: 1
zpe: 499492.9 jmol-1
zpe.correction: 0.190247 hartree
zpe.thermalcorrener: 0.202031 hartree
zpe.thermalcorrenthalpy: 0.202975 hartree
zpe.thermalcorrgfe: 0.152854 hartree
zpe.sumelectzpe: -625.212314 hartree
zpe.sumelectthermal: -625.200530 hartree
zpe.sumelectthermalent: -625.199586 hartree
zpe.sumelectthermalfe: -625.249707 hartree
dipole: 5.6373 4.1982 0.0034
dipole: 7.0287
quadrupole: -68.7437 -81.9861 -76.1312
quadrupole: 7.8610 0.0194 0.0009
quadrupole: 6.8766 -6.3658 -0.5108 7.8610 0.0194 0.0009
hfenergy: -625.4025612 hartree
pointgroup: C01 [X(C8H11N3O2)]
dipole: -2.1140821 -1.7825961 0.0032025 debye
dipolederiv: -0.6114427 -0.1330009 0.0000756 -0.2345205 -1.4124475 0.0012954 0.0005682 0.0008549 -0.3707647 -1.116955 0.4331892 -0.0002029 0.3746427 -0.8074524 0.0002336 -0.0010422 0.0009059 -0.376208 -1.2158806 -0.4402056 0.000082 -0.2549475 -0.5699707 -0.0008304 -0.0016789 -0.002226 -0.4752148 -1.2534921 0.3967931 -0.0005949 -0.0707515 -0.8405258 0.0005969 0.0000346 0.0001589 -0.1630126 -0.8926289 0.2039968 -0.0005893 0.3693483 -1.1456189 0.000553 0.0006408 0.0014288 -0.2060537 -0.5187134 -0.4240041 0.0003876 -0.63317 -0.9542663 0.0006661 0.0008771 0.0008556 -0.2286703 0.0208731 -0.0944144 0.0001824 -0.0138482 0.0854395 0.000092 0.0002223 0.0002464 0.2099059 1.4146847 0.0125856 0.0001351 0.4358678 1.2686028 -0.000759 -0.0002298 0.000169 0.1635246 0.5204895 -0.0989776 -0.000055 -0.3877979 0.1068081 0.000562 0.0003719 0.000392 0.3485741 1.381295 0.2268441 -0.0002303 0.0878637 1.7554965 -0.0016696 -0.0002454 -0.001653 0.213075 1.6236715 -0.3007214 0.0005167 -0.1571884 1.2747569 -0.0008142 0.0009844 -0.0015049 0.2576918 -0.0435754 0.0358415 0.0000353 0.0667199 0.5345205 -0.0002992 -0.0000296 -0.0004239 0.2462051 0.3315374 0.1348678 0.0009684 0.2140843 0.1285469 0.0008661 0.0005746 0.000677 0.2116426 0.0185395 0.0485596 0.032895 0.0538879 -0.0032752 -0.082168 0.0799911 -0.1087786 -0.0367338 0.0182897 0.048608 -0.0330462 0.0536257 -0.0028352 0.0820901 -0.0802416 0.1086687 -0.0372958 -0.0929693 -0.0078746 0.0900667 0.042732 0.0675639 0.0238233 0.1679079 0.0278108 -0.0715291 -0.0935831 -0.0080964 -0.0900909 0.0422139 0.0675878 -0.0239919 -0.1676751 -0.0279072 -0.0705735 0.1801696 0.0376336 0.0001016 0.0760619 0.1599344 0.0004748 0.0009795 0.0014034 0.3482249 0.0598944 -0.1153262 -0.106831 -0.0344762 -0.0228942 -0.0141461 -0.0827466 -0.077671 -0.0601863 0.0600782 -0.1150421 0.1068863 -0.0343567 -0.0229241 0.0141539 0.0827193 0.0778899 -0.0606801 0.0613563 0.1529055 0.0000388 0.008851 0.1606406 0.0000205 0.0001065 0.0000156 0.1361447 -0.0259454 -0.0371632 0.0627549 0.0351034 0.0926836 -0.0749978 0.095898 -0.0207503 -0.0495908 -0.0262301 -0.0385392 -0.0625461 0.0319877 0.0931959 0.0727424 -0.0973887 0.0185001 -0.0535007 0.2005371 0.0815409 -0.0009399 -0.0719333 -0.013567 0.0015061 -0.0005981 0.0009381 0.1250254 unknown
polarizability: 141.8284239|4.0277672|133.812512|0.0074719|-0.0510248|63.3483678 unknown
InChI: InChI=1S/C8H11N3O2/c1-10-6-5(3-4-9-6)7(12)11(2)8(10)13/h9H,3-4H2,1-2H3
charge 0 multiplicity 1
24 atoms
O  0.451104 2.779084 -0.003513
O  2.573147 -1.436945 0.000923
N  -2.202774 -1.119821 0.000216
N  0.224945 -1.381519 0.000021
N  1.506346 0.650473 -0.001796
C  -0.909956 0.780839 -0.0013
C  -2.338176 1.298888 -0.001471
C  -0.921145 -0.608983 -0.000235
C  -3.205517 -0.016368 0.000779
C  0.31336 1.515394 -0.002465
C  1.511844 -0.744946 -0.000657
C  0.173919 -2.852837 0.001214
C  2.831111 1.307475 -0.001942
H  -2.548865 1.923027 0.885006
H  -2.549491 1.920366 -0.889678
H  -3.84864 -0.083361 0.897623
H  -3.851235 -0.084813 -0.89405
H  -2.446419 -2.106508 0.003278
H  -0.337941 -3.23177 -0.902853
H  -0.336614 -3.2305 0.90658
H  1.214385 -3.211322 0.000786
H  3.40909 1.004437 -0.890982
H  3.402477 1.019912 0.896639
H  2.647846 2.392296 -0.011023
