program: Gaussian 09
title: 000224427
version: EM64L-G09RevD.01
frameworkgroup: C1[X(C17H15NO)]
method: RPBEPBE
basis: SDD
operation: Freq
keyword: #p
keyword: freq=noraman
keyword: PBEPBE/SDD
title: #p freq=noraman PBEPBE/SDD
converged: YES YES NO NO
title: Mulliken charges:
elementType: O N C C C C C C C C C C C C C C C C C H H H H H H H H H H H H H H H
charge: -0.267962 -0.413488 0.223178 0.541174 0.284870 -0.724719 -0.644247 0.379093 -0.367130 -0.401585 0.497901 -0.458249 0.052349 -0.813409 -0.377411 -0.449716 -0.225273 -0.221418 -0.248260 0.226520 0.230166 0.249925 0.250214 0.232213 0.326741 0.250189 0.239366 0.236821 0.237512 0.240684 0.232006 0.226294 0.226278 0.229373
chargesum: 0.00000
title: Mulliken charges with hydrogens summed into heavy atoms:
elementType: O N C C C C C C C C C C C C C C C C C
charge: -0.267962 -0.086747 0.223178 0.541174 0.284870 -0.268033 -0.394323 0.379093 -0.116916 -0.169372 0.497901 -0.208060 0.052349 -0.099710 -0.136727 -0.217709 0.001020 0.004860 -0.018887
polarizability: 3.06691070e+02 5.49278123e+00 1.62894245e+02 2.32865424e+01 -2.38297493e+00 1.31896466e+02
1716.lowfreq: -5.9912 -0.0007 -0.0004 0.0007 1.5416 6.2691 19.1493 26.5277 42.3039
frequency: 19.0521 26.5065 42.2955 87.1065 151.5694 162.0360 171.4528 188.3582 215.4943 216.7776 281.8175 313.6368 332.3897 356.4158 404.0283 419.5636 442.1199 468.8931 491.2426 515.8463 524.9076 550.3643 570.8125 601.0501 617.9752 640.5368 671.0205 704.2140 720.2808 733.0966 752.2707 766.9029 797.7869 833.8617 844.9942 854.7700 872.7313 893.2702 912.0974 922.3657 932.2763 955.3623 967.4735 977.6302 990.7156 996.0849 1006.5285 1026.7271 1046.4994 1069.3875 1082.3559 1155.0740 1171.8396 1185.5382 1187.0521 1190.0001 1209.0472 1234.0364 1249.0322 1272.6320 1289.2427 1292.7086 1334.6464 1356.6824 1382.2130 1394.9616 1402.7466 1410.6501 1440.2412 1449.1235 1461.6434 1469.5129 1470.6424 1483.9376 1496.5039 1562.1280 1592.1747 1595.6818 1613.6298 1627.3758 1655.1920 2969.5885 2977.9982 3015.7602 3053.9985 3098.7372 3113.9598 3119.9225 3122.4242 3133.2734 3134.1246 3144.4203 3147.5157 3162.5228 3169.3205 3511.9686
redmass: 4.6378 3.8779 5.6417 5.8129 3.8850 4.6332 1.5887 4.1530 3.8552 1.8414 3.6976 3.3457 4.7696 3.0659 2.8099 3.3230 5.2265 3.7759 5.4556 3.1272 4.9176 4.5086 4.0138 3.8217 5.4610 3.0603 2.7172 2.1160 2.7292 1.8172 2.1998 3.6034 2.7614 1.7383 3.7578 1.2478 1.4531 1.5247 2.2872 2.0386 3.1536 1.6390 1.6053 1.3927 6.1305 1.3259 1.9500 2.2115 1.5685 2.2290 1.5861 1.3817 1.0577 2.0459 1.1289 1.1702 2.4625 2.1332 1.6499 2.5327 2.0571 1.6967 1.3274 2.0757 7.3145 1.5647 1.7757 6.5171 2.0953 3.4238 1.2296 1.0661 1.0957 2.2311 3.0731 6.1737 5.7699 5.5281 6.1124 6.6693 6.0703 1.0597 1.0381 1.1004 1.0971 1.0983 1.0874 1.0863 1.0877 1.0910 1.0907 1.0959 1.0967 1.1015 1.0925 1.0766
irintensity: 0.3243 0.0676 0.8389 2.0071 1.0177 1.6806 0.0657 5.8471 0.9224 0.5055 0.5811 1.3847 2.6672 4.1934 0.1972 3.1721 1.9157 15.1469 6.6767 8.2546 1.9421 3.8445 4.5653 0.9701 0.6331 7.3344 28.0889 35.3388 28.3397 41.5593 37.7145 1.5841 27.0135 42.0060 4.2205 0.0365 18.4311 12.2329 6.0854 1.7464 15.3378 6.4157 2.8258 0.0922 0.5575 0.5056 2.3173 10.5812 6.0507 4.7654 14.4838 9.9117 0.2581 0.2105 0.4986 5.4082 2.0228 4.6973 11.7781 20.4800 17.2291 1.6600 1.3952 47.4774 1.9343 19.3646 41.8170 19.9516 6.3526 16.2850 21.4085 13.9200 9.7876 24.6294 23.7575 15.5165 30.4285 88.9809 16.8826 33.1146 516.3007 28.0149 17.4871 11.3297 15.4063 22.6058 9.0895 4.4115 9.0903 11.2830 11.8372 42.1731 11.2745 27.0620 3.6240 31.2878
temp: 298.150 k
press: 1.00000 atm
elementType: 8 7 6 6 6 6 6 6 6 6 6 6 6 6 6 6 6 6 6 1 1 1 1 1 1 1 1 1 1 1 1 1 1 1
symmnumber: 1
zpe: 715692.1 jmol-1
zpe.correction: 0.272593 hartree
zpe.thermalcorrener: 0.288306 hartree
zpe.thermalcorrenthalpy: 0.289250 hartree
zpe.thermalcorrgfe: 0.227806 hartree
zpe.sumelectzpe: -785.504599 hartree
zpe.sumelectthermal: -785.488886 hartree
zpe.sumelectthermalent: -785.487942 hartree
zpe.sumelectthermalfe: -785.549385 hartree
dipole: -4.7114 1.8253 -0.8988
dipole: 5.1319
quadrupole: -137.3817 -102.3282 -108.5229
quadrupole: 15.6540 -1.3033 2.0272
quadrupole: -21.3041 13.7494 7.5547 15.6540 -1.3033 2.0272
hfenergy: -785.7771917 hartree
pointgroup: C01 [X(C17H15N1O1)]
dipole: -1.8846126 -0.1363172 0.7115032 debye
polarizability: 302.4538843|-33.0901051|151.4889109|-12.5675445|-14.9341693|147.5389867 unknown
InChI: InChI=1S/C17H15NO/c1-12-9-17(19)18-16-8-7-14(11-15(12)16)10-13-5-3-2-4-6-13/h2-9,11,18H,10H2,1H3
charge 0 multiplicity 1
34 atoms
O  5.503809 0.301963 -1.315307
N  3.266542 0.862108 -0.958001
C  1.786828 -0.487128 0.434661
C  -0.572147 0.211551 0.743287
C  2.002077 0.655755 -0.403506
C  -1.942656 0.004003 1.384072
C  0.489315 -0.678123 0.9908
C  2.908149 -1.397544 0.676546
C  -0.32776 1.335712 -0.099335
C  0.935973 1.558965 -0.663645
C  -3.126721 0.088373 0.419996
C  4.135523 -1.1338 0.097079
C  4.392071 0.024145 -0.764046
C  2.717052 -2.616008 1.556525
C  -3.129556 -0.647237 -0.793974
C  -4.259749 0.879262 0.73492
C  -4.23877 -0.597409 -1.665879
C  -5.372944 0.932944 -0.135956
C  -5.366489 0.19317 -1.339954
H  -2.089964 0.753909 2.187052
H  -1.950197 -0.984432 1.885673
H  0.313068 -1.548701 1.632963
H  -1.147127 2.031168 -0.314061
H  1.106874 2.429382 -1.308528
H  3.428545 1.676547 -1.558714
H  4.994062 -1.79226 0.257413
H  3.651458 -3.194502 1.637742
H  1.934697 -3.285635 1.151654
H  2.402756 -2.328576 2.577721
H  -2.254928 -1.254736 -1.056508
H  -4.271597 1.456537 1.668276
H  -4.225376 -1.172879 -2.598604
H  -6.240013 1.550768 0.124092
H  -6.227003 0.233006 -2.017153
