program: Gaussian 09
title: 000224429
version: EM64L-G09RevD.01
frameworkgroup: C1[X(C18H14N2O6)]
method: RPBEPBE
basis: SDD
operation: Freq
keyword: #p
keyword: freq=noraman
keyword: PBEPBE/SDD
title: #p freq=noraman PBEPBE/SDD
converged: YES YES NO NO
title: Mulliken charges:
elementType: O O O O O O N N C C C C C C C C C C C C C C C C C C H H H H H H H H H H H H H H
charge: -0.238594 -0.238596 -0.426140 -0.426141 -0.229275 -0.229275 -0.457439 -0.457440 0.236299 0.236298 0.322876 0.322876 -0.385165 -0.385167 -0.381415 -0.381415 -0.274003 -0.274002 0.190073 0.190075 -0.255063 -0.255059 -0.278877 -0.278875 0.177329 0.177328 0.192514 0.192515 0.313909 0.313910 0.234971 0.234971 0.326227 0.326226 0.284790 0.284789 0.260525 0.260522 0.386458 0.386458
chargesum: 0.00000
title: Mulliken charges with hydrogens summed into heavy atoms:
elementType: O O O O O O N N C C C C C C C C C C C C C C C C C C
charge: -0.238594 -0.238596 -0.039682 -0.039683 -0.229275 -0.229275 -0.131212 -0.131214 0.236299 0.236298 0.322876 0.322876 -0.192651 -0.192651 -0.067506 -0.067505 -0.039032 -0.039030 0.190073 0.190075 0.029727 0.029729 -0.018352 -0.018353 0.177329 0.177328
polarizability: 4.92688421e+02 1.09370876e+01 2.72259920e+02 -1.30464613e+01 3.13078790e+00 1.06217082e+02
1716.lowfreq: -3.7296 -0.0009 -0.0005 0.0009 0.9000 4.6640 10.6445 24.8650 26.1414
frequency: 10.6445 24.8650 26.0363 38.7930 41.7743 47.9037 55.5084 75.6594 79.9867 124.9958 134.2426 152.3725 159.7663 168.0638 169.7466 179.2049 195.8643 208.1736 225.1798 265.4332 286.3109 318.7746 379.1915 387.9562 426.4783 445.4750 468.2186 478.8658 506.2297 509.8820 528.1173 529.2190 552.7364 555.3519 584.6295 585.4210 593.4367 614.7490 619.6330 633.1635 648.9445 654.0047 693.7501 717.5435 724.5708 729.0341 743.2120 773.3893 778.1124 793.4051 822.4543 844.3436 865.9562 889.9224 898.9515 910.7594 914.0656 924.9396 928.3903 947.8344 989.2627 990.0732 995.5401 995.6960 1001.6322 1053.2641 1056.4213 1092.2002 1095.5817 1161.7536 1200.7167 1205.4332 1217.0315 1220.1634 1223.6754 1227.5584 1260.6509 1264.2913 1265.0435 1285.0027 1286.4262 1327.6156 1328.6177 1345.3937 1399.6928 1405.8228 1436.9637 1459.5315 1482.8088 1505.0568 1542.3302 1583.9982 1584.8259 1594.4124 1598.3482 1629.1672 1636.6153 1638.3440 1649.5159 1649.6469 3117.6879 3118.1640 3144.0412 3144.0569 3150.4437 3150.4640 3156.5926 3156.9591 3197.9154 3198.0891 3524.6434 3524.6713 3550.6031 3550.8120
redmass: 8.4420 8.0187 5.5899 9.4942 7.7339 9.7632 11.0712 6.3161 4.7002 6.2022 5.0173 3.5124 3.8569 3.3873 4.6559 4.3104 5.2949 6.8439 4.3950 7.2456 8.4528 4.3034 6.7963 6.6006 6.5826 6.3087 3.3923 5.0455 3.8860 6.6463 4.5047 3.1713 4.7975 1.9481 1.7314 2.0418 4.0580 3.1441 1.6075 1.5730 2.2950 2.2354 4.1643 6.3911 7.0384 1.3518 6.7207 5.5694 1.4003 5.9232 4.8361 4.5792 3.8333 2.2765 2.6981 1.3534 1.3930 6.8140 5.4728 4.3050 1.3415 1.3443 1.1244 1.1253 3.9783 2.1616 2.2106 1.9128 2.4586 2.4334 1.3617 1.2030 1.9672 1.6989 1.6130 1.7706 1.8349 1.3752 1.4126 2.3385 2.8411 2.1252 2.1366 3.0243 7.3268 2.5237 2.7449 2.1671 2.4909 2.1799 3.2670 6.2692 5.7389 8.1026 3.8030 4.7838 7.9639 8.0229 6.3808 6.2981 1.0875 1.0869 1.0976 1.0976 1.0866 1.0866 1.0947 1.0947 1.0950 1.0950 1.0642 1.0642 1.0751 1.0752
irintensity: 0.8081 3.9709 0.0000 2.7582 0.0000 0.0000 3.0802 0.0000 5.4836 2.8005 0.0000 0.0000 2.0150 10.2218 0.0000 5.3706 0.0000 2.5595 0.0000 0.0000 8.5236 12.7066 11.2489 0.0000 0.0000 41.3852 0.0000 12.1540 0.0000 0.0000 0.0001 162.2430 0.0000 3.3837 0.0010 121.2979 31.7350 0.0000 0.0000 126.0972 88.0124 0.0000 4.4478 55.5756 0.0000 0.0000 42.3006 11.1764 184.8394 0.0000 0.0000 0.0000 3.4999 0.0000 8.0225 0.0000 18.5882 0.0000 16.0897 0.0000 13.4836 0.0000 0.0045 106.6688 92.9233 0.0002 696.3114 0.0000 10.9559 0.0000 23.4122 0.0000 0.0000 123.4981 4.9336 0.0000 30.9898 0.0001 57.6706 0.0000 13.1982 247.3555 0.0002 240.2260 0.0000 0.0000 277.2224 0.0000 560.1219 0.0000 435.5089 290.5444 0.0018 0.0000 45.4452 0.0000 720.9287 0.0000 113.5805 0.0019 37.9810 0.0012 18.4281 0.0018 6.6235 0.0207 42.1784 0.0003 14.5886 0.0011 121.0235 1.1911 0.0002 47.2566
temp: 298.150 k
press: 1.00000 atm
elementType: 8 8 8 8 8 8 7 7 6 6 6 6 6 6 6 6 6 6 6 6 6 6 6 6 6 6 1 1 1 1 1 1 1 1 1 1 1 1 1 1
symmnumber: 1
zpe: 760603.1 jmol-1
zpe.correction: 0.289698 hartree
zpe.thermalcorrener: 0.313559 hartree
zpe.thermalcorrenthalpy: 0.314504 hartree
zpe.thermalcorrgfe: 0.231827 hartree
zpe.sumelectzpe: -1253.353891 hartree
zpe.sumelectthermal: -1253.330030 hartree
zpe.sumelectthermalent: -1253.329086 hartree
zpe.sumelectthermalfe: -1253.411762 hartree
dipole: 0.0000 0.0000 0.0001
dipole: 0.0002
quadrupole: -164.0668 -154.1936 -154.0271
quadrupole: 47.0618 8.9741 -2.3745
quadrupole: -6.6376 3.2356 3.4020 47.0618 8.9741 -2.3745
hfenergy: -1253.6435892 hartree
pointgroup: C01 [X(C18H14N2O6)]
dipole: -0.0000132 0.0000151 0.0000585 debye
polarizability: 491.2944399|21.1795471|230.2632768|20.3947891|-71.5743189|149.607707 unknown
InChI: InChI=1S/C18H14N2O6/c21-15(7-9-17(23)24)19-13-5-1-3-11-12(13)4-2-6-14(11)20-16(22)8-10-18(25)26/h1-10,19-20,23,25H
charge 0 multiplicity 1
40 atoms
O  3.968872 -2.409968 1.606426
O  -3.968861 2.409908 -1.606562
O  7.385185 1.484434 -1.29803
O  -7.385221 -1.484366 1.298051
O  8.133739 0.487509 0.67288
O  -8.133785 -0.48742 -0.672846
N  3.007854 -0.498101 0.597687
N  -3.007866 0.49808 -0.597733
C  0.703192 0.170722 0.050929
C  -0.703197 -0.170762 -0.051025
C  1.632649 -0.842084 0.526543
C  -1.632657 0.842049 -0.526625
C  1.124283 1.489637 -0.323326
C  -1.124285 -1.489683 0.323208
C  1.177648 -2.119713 0.893487
C  -1.177654 2.119673 -0.893586
C  0.203632 2.431104 -0.785536
C  -0.203634 -2.431152 0.785412
C  4.075972 -1.258936 1.08113
C  -4.075979 1.258906 -1.081201
C  5.42328 -0.621734 0.941971
C  -5.423298 0.621742 -0.941992
C  5.823161 0.17662 -0.089135
C  -5.823181 -0.1766 0.089122
C  7.212558 0.692473 -0.151583
C  -7.212593 -0.692412 0.151598
H  2.172071 1.802748 -0.25108
H  -2.172069 -1.802803 0.250933
H  1.891141 -2.859381 1.258357
H  -1.891147 2.859341 -1.258455
H  0.542621 3.432955 -1.067963
H  -0.542619 -3.433011 1.067816
H  3.254789 0.441579 0.285128
H  -3.254808 -0.441578 -0.285114
H  6.152592 -0.917724 1.706206
H  -6.152621 0.917753 -1.706209
H  5.173001 0.445523 -0.929522
H  -5.173017 -0.445527 0.929498
H  8.320938 1.822334 -1.328513
H  -8.320983 -1.822238 1.328554
