program: Gaussian 09
title: 000224426
version: EM64L-G09RevD.01
frameworkgroup: C1[X(C16H13NO)]
method: RPBEPBE
basis: SDD
operation: Freq
keyword: #p
keyword: freq=noraman
keyword: PBEPBE/SDD
title: #p freq=noraman PBEPBE/SDD
converged: NO YES NO NO
title: Mulliken charges:
elementType: O N C C C C C C C C C C C C C C C C H H H H H H H H H H H H H
charge: -0.281378 -0.220673 0.205734 0.383077 0.169762 -0.413230 0.039469 0.340669 -0.338771 -0.404586 -0.666994 -0.234622 -0.263896 -0.358459 -0.404080 -0.239789 -0.242095 -0.239674 0.257126 0.254628 0.235633 0.293727 0.236463 0.236527 0.230147 0.233362 0.278199 0.235052 0.226139 0.224366 0.228168
chargesum: 0.00000
title: Mulliken charges with hydrogens summed into heavy atoms:
elementType: O N C C C C C C C C C C C C C C C C
charge: -0.281378 -0.220673 0.205734 0.383077 0.169762 -0.156105 0.039469 0.340669 -0.084143 -0.168953 0.099723 -0.004475 -0.030535 -0.080261 -0.169029 -0.013650 -0.017729 -0.011506
polarizability: 3.28906668e+02 1.91132985e+01 1.88718452e+02 -5.65260101e-01 -7.77642023e+00 8.42352163e+01
1716.lowfreq: -7.1971 -5.0192 0.0001 0.0003 0.0007 9.5321 49.7245 52.1510 90.8971
frequency: 49.7139 52.1477 90.8944 100.5235 129.9565 187.6080 220.4289 251.7858 270.9991 293.4586 313.5355 348.3513 401.5711 410.1323 431.9152 443.5861 484.7926 490.4698 528.0077 559.0148 574.5133 615.4535 630.0848 655.9889 696.9773 710.1638 733.2503 757.9746 763.4840 784.9361 818.9906 846.1134 858.0248 881.4194 910.7045 918.0824 931.0003 951.9587 972.6253 982.7943 988.3262 994.2603 1027.9065 1037.1754 1054.2255 1087.9965 1103.2709 1121.8744 1136.7575 1173.5267 1177.5270 1197.6658 1223.9971 1236.6068 1278.0382 1304.6984 1316.8119 1330.6727 1353.0160 1379.7001 1409.6524 1417.7852 1435.1826 1445.8894 1473.9131 1486.2091 1495.4250 1500.1456 1557.7949 1567.5006 1580.3969 1607.7805 1614.2937 1625.0239 2989.9308 3076.6195 3121.0658 3123.9834 3128.2434 3129.8637 3132.4861 3140.2767 3144.1231 3160.6361 3164.1818 3179.0795 3190.4494
redmass: 4.7409 3.8856 5.8170 4.3389 3.4831 4.4912 1.1126 6.0497 4.2802 4.0844 4.1025 4.2639 3.1299 3.7547 4.4248 8.3498 3.0670 5.3428 3.7537 3.6638 6.5300 6.1768 5.4990 6.2291 1.8452 4.6989 3.9399 1.2884 2.8923 3.0738 4.9108 1.2627 1.4335 4.9242 1.5171 2.3911 1.7108 1.4358 1.3889 1.3289 4.1842 1.4528 2.6901 2.3363 3.3395 1.6205 2.3963 1.3149 1.5961 1.0524 1.0923 1.1283 2.0066 1.6606 2.7582 3.2437 1.5629 2.0750 2.1707 5.8945 7.4111 1.3230 2.2081 2.4818 1.1556 2.4452 2.5952 1.0470 7.4591 6.8874 5.7663 6.0983 7.2425 6.7533 1.0348 1.1024 1.0850 1.0986 1.0885 1.0887 1.0896 1.0896 1.0941 1.0998 1.0958 1.0966 1.0950
irintensity: 1.6712 0.8690 1.9185 2.2966 0.3974 0.9913 0.6662 1.1368 1.0281 0.1205 0.7861 0.1626 3.0161 7.1428 0.6006 3.9474 9.6265 11.6972 9.2996 1.6767 19.4178 1.0419 4.9684 0.9519 46.1417 13.0325 2.4473 81.0836 6.2165 53.4463 2.7846 2.5803 2.4847 1.2566 14.9676 15.5635 3.4743 8.8973 2.7763 0.0206 0.0962 0.8116 8.8571 8.8130 1.6476 9.5774 35.8539 0.1237 7.9116 0.0048 0.9509 9.0187 14.5252 32.6438 2.4367 21.8583 1.4119 4.6464 1.0794 1.9357 13.1305 28.7586 4.6347 51.5534 61.7228 23.5476 3.6443 18.6321 254.8375 12.3254 1.3762 1.5907 39.1848 47.9189 43.6424 23.3902 5.7315 1.9366 0.8201 14.4598 2.1076 9.4519 34.2059 40.1320 26.5372 17.5682 5.9508
temp: 298.150 k
press: 1.00000 atm
elementType: 8 7 6 6 6 6 6 6 6 6 6 6 6 6 6 6 6 6 1 1 1 1 1 1 1 1 1 1 1 1 1
symmnumber: 1
zpe: 642845.8 jmol-1
zpe.correction: 0.244847 hartree
zpe.thermalcorrener: 0.258969 hartree
zpe.thermalcorrenthalpy: 0.259914 hartree
zpe.thermalcorrgfe: 0.203657 hartree
zpe.sumelectzpe: -746.270807 hartree
zpe.sumelectthermal: -746.256684 hartree
zpe.sumelectthermalent: -746.255740 hartree
zpe.sumelectthermalfe: -746.311997 hartree
dipole: -2.9439 -1.9414 -0.2408
dipole: 3.5346
quadrupole: -86.5011 -97.8616 -109.2363
quadrupole: -7.0144 -1.4429 -2.9372
quadrupole: 11.3653 0.0047 -11.3700 -7.0144 -1.4429 -2.9372
hfenergy: -746.5156536 hartree
pointgroup: C01 [X(C16H13N1O1)]
dipole: 1.1613737 0.7464131 0.1671528 debye
polarizability: 328.8305635|15.9711264|174.1197494|11.3860485|37.0282699|98.9100233 unknown
InChI: InChI=1S/C16H13NO/c1-17-15-10-6-5-9-13(15)11-14(16(17)18)12-7-3-2-4-8-12/h2-11H,1H3
charge 0 multiplicity 1
31 atoms
O  -0.690707 -2.389876 -0.596522
N  1.425695 -1.438604 -0.300033
C  2.273924 -0.351012 -0.03726
C  1.687944 0.93303 0.226741
C  -0.591126 -0.018807 -0.032734
C  0.253836 1.05265 0.21601
C  -0.00546 -1.348909 -0.331415
C  -2.07086 0.150064 -0.002154
C  3.691499 -0.485188 -0.033154
C  2.537704 2.046892 0.483167
C  2.008753 -2.770573 -0.568546
C  4.50501 0.632407 0.226795
C  3.933611 1.906891 0.486246
C  -2.934663 -0.573972 -0.871673
C  -2.654297 1.090127 0.895871
C  -4.326818 -0.343204 -0.856246
C  -4.045923 1.316126 0.912343
C  -4.89081 0.602551 0.030572
H  -0.17721 2.045398 0.390443
H  4.159283 -1.452286 -0.232155
H  2.0770 3.022304 0.679811
H  1.171225 -3.464014 -0.732525
H  2.608493 -3.1126 0.293401
H  2.645562 -2.743806 -1.47069
H  5.594038 0.513081 0.226705
H  4.578103 2.768779 0.685171
H  -2.509509 -1.320344 -1.545581
H  -2.016683 1.621564 1.611997
H  -4.97353 -0.90756 -1.537386
H  -4.471771 2.036153 1.6202
H  -5.97321 0.77314 0.0431
