program: Gaussian 09
title: 000217946
version: EM64L-G09RevD.01
frameworkgroup: C1[X(C13H11N3O2)]
method: RPBEPBE
basis: SDD
operation: Freq
keyword: #p
keyword: freq=noraman
keyword: PBEPBE/SDD
title: #p freq=noraman PBEPBE/SDD
converged: NO YES NO NO
title: Mulliken charges:
elementType: O O N N N C C C C C C C C C C C C C H H H H H H H H H H H
charge: -0.247961 -0.255570 -0.294426 -0.234049 -0.399809 0.242124 0.109001 0.208437 0.124570 0.424853 -0.328973 -0.226343 -0.603925 -0.417199 -0.326830 -0.214989 -0.214124 -0.237684 0.343082 0.273172 0.258261 0.271140 0.248838 0.245820 0.276573 0.268860 0.235295 0.235509 0.236350
chargesum: 0.00000
title: Mulliken charges with hydrogens summed into heavy atoms:
elementType: O O N N N C C C C C C C C C C C C C
charge: -0.247961 -0.255570 -0.294426 -0.234049 -0.056727 0.242124 0.109001 0.208437 0.124570 0.424853 -0.055801 0.031918 0.161872 -0.140626 -0.057970 0.020306 0.021385 -0.001335
polarizability: 2.30520848e+02 -1.87324442e+00 1.74031293e+02 -1.79412958e+00 1.08312391e+01 9.41984422e+01
1716.lowfreq: -8.3719 -8.1343 -4.8000 0.0007 0.0008 0.0010 43.7621 52.3409 78.9310
frequency: 43.7550 52.3138 78.9299 104.1538 111.3600 126.7189 178.3057 235.6796 240.6560 270.1398 285.9226 314.0390 355.4548 392.2220 406.3538 428.2621 450.2637 478.6375 509.1220 579.4058 598.5053 602.4915 613.0977 634.4987 659.4014 696.2537 701.5094 711.7304 745.4867 758.1002 784.8552 845.8420 860.1205 874.5524 885.1510 919.4455 970.0248 974.3404 988.8943 992.0716 996.9524 1025.2240 1050.9745 1074.1218 1081.9309 1101.8881 1130.6682 1168.2560 1174.5522 1186.4719 1232.2207 1247.4479 1276.3741 1303.3521 1314.6608 1339.4090 1382.0913 1408.0859 1424.5542 1440.0681 1475.2437 1476.6061 1482.2742 1496.2332 1527.1347 1574.8405 1595.2387 1607.0530 1619.2203 1652.8086 3011.4049 3103.4760 3131.3498 3137.6647 3140.7980 3152.4547 3167.0498 3183.9651 3230.8777 3255.0878 3588.5879
redmass: 6.5271 4.1039 5.1576 4.1351 1.4390 2.3764 6.6024 5.3743 4.8452 4.8307 5.6843 4.8869 4.1163 10.8977 2.8792 7.1444 5.9287 8.5179 3.7200 1.8953 7.3232 1.7620 6.3080 4.7733 6.2499 2.2215 7.7398 1.6628 2.1415 4.3439 2.9874 1.2972 5.5354 1.3340 5.8409 1.4243 3.9055 1.4080 4.5782 2.7468 1.3888 2.1144 1.8000 1.8444 1.6337 3.5668 1.3073 2.3089 1.0528 1.1729 2.2616 3.3465 4.8153 2.7414 1.5382 1.9596 8.9730 3.4672 1.4620 2.2958 1.0909 1.0496 2.3558 4.2822 7.4277 6.8014 6.5161 6.2004 9.4172 10.7673 1.0328 1.1022 1.0860 1.1022 1.0890 1.0942 1.0986 1.0978 1.0912 1.1078 1.0812
irintensity: 0.7145 0.6869 0.6209 9.0181 0.8595 0.7382 0.0227 0.5101 1.3996 3.7082 1.2248 10.5019 9.0083 11.6238 1.7319 0.4223 18.5355 5.0367 27.6036 53.8993 4.1332 19.0394 1.9988 1.1918 12.5081 29.0239 0.6177 111.1436 42.2197 2.1922 23.4484 1.3701 4.4122 7.6568 8.4361 0.3759 5.7258 0.9624 3.6973 63.1869 0.0773 2.5456 48.8585 3.9636 19.7183 21.4086 0.1080 2.9531 0.0505 0.0441 17.0600 38.1282 173.5073 51.5911 11.5815 23.5496 2.8725 24.9283 57.0975 27.4763 22.1772 18.3433 52.6555 42.4298 165.7010 7.0166 4.9733 25.4000 623.5133 416.8445 31.0461 18.2321 2.8898 0.8569 3.8648 20.2843 22.1937 2.1405 0.9782 1.2118 62.3624
temp: 298.150 k
press: 1.00000 atm
elementType: 8 8 7 7 7 6 6 6 6 6 6 6 6 6 6 6 6 6 1 1 1 1 1 1 1 1 1 1 1
symmnumber: 1
zpe: 576760.0 jmol-1
zpe.correction: 0.219676 hartree
zpe.thermalcorrener: 0.234342 hartree
zpe.thermalcorrenthalpy: 0.235286 hartree
zpe.thermalcorrgfe: 0.177556 hartree
zpe.sumelectzpe: -815.462517 hartree
zpe.sumelectthermal: -815.447851 hartree
zpe.sumelectthermalent: -815.446907 hartree
zpe.sumelectthermalfe: -815.504637 hartree
dipole: 5.3414 3.6090 -0.5818
dipole: 6.4726
quadrupole: -107.5337 -97.0181 -102.2761
quadrupole: 6.2340 -0.4438 3.4208
quadrupole: -5.2578 5.2579 -0.0001 6.2340 -0.4438 3.4208
hfenergy: -815.6821933 hartree
pointgroup: C01 [X(C13H11N3O2)]
dipole: 2.0548174 -1.5030977 -0.0561306 debye
polarizability: 230.5128158|-0.7295471|166.2926406|3.6675773|25.8651321|101.9451271 unknown
InChI: InChI=1S/C13H11N3O2/c1-15-12(17)10-7-8-14-11(10)16(13(15)18)9-5-3-2-4-6-9/h2-8,14H,1H3
charge 0 multiplicity 1
29 atoms
O  0.146319 2.531725 0.429495
O  -4.032488 0.427852 -0.065022
N  0.149821 0.206838 0.071435
N  -1.917375 1.452821 0.177353
N  -0.185015 -2.242391 -0.203531
C  -0.62897 -0.938092 -0.102819
C  -2.033712 -0.938389 -0.155208
C  -0.505202 1.467416 0.242619
C  -2.774898 0.300017 -0.027245
C  1.598053 0.138484 0.045694
C  -2.45748 -2.31022 -0.30181
C  -1.308541 -3.094527 -0.32994
C  -2.566686 2.77471 0.340944
C  2.241377 -0.465208 -1.063064
C  2.356459 0.660896 1.11851
C  3.650421 -0.567089 -1.082976
C  3.764197 0.566241 1.082383
C  4.414979 -0.053476 -0.010411
H  0.79073 -2.535704 -0.177822
H  -3.487043 -2.652658 -0.372934
H  -1.182482 -4.16985 -0.429157
H  -3.650685 2.614673 0.248026
H  -2.208485 3.471527 -0.434137
H  -2.322137 3.199415 1.328427
H  1.647878 -0.81508 -1.915187
H  1.84825 1.148817 1.953858
H  4.147703 -1.028442 -1.943009
H  4.353058 0.977497 1.909047
H  5.507655 -0.125004 -0.03072
