program: Gaussian 09
title: 000217944
version: EM64L-G09RevD.01
frameworkgroup: C1[X(C22H29NO)]
method: RPBEPBE
basis: SDD
operation: Freq
keyword: #p
keyword: freq=noraman
keyword: PBEPBE/SDD
title: #p freq=noraman PBEPBE/SDD
converged: YES YES NO NO
title: Mulliken charges:
elementType: O N C C C C C C C C C C C C C C C C C C C C C C H H H H H H H H H H H H H H H H H H H H H H H H H H H H H
charge: -0.469152 -0.073086 -0.364688 -0.356107 -0.365155 -0.491115 -0.398445 -0.392252 -0.397710 0.025059 0.381761 0.373697 -0.385388 -0.368113 -0.402575 -0.427434 -0.371220 -0.361037 -0.418640 -0.438412 0.439570 0.440862 -0.811918 -0.810284 0.229505 0.200562 0.200318 0.168845 0.162781 0.214412 0.218045 0.209498 0.203657 0.188647 0.189995 0.202333 0.188267 0.211436 0.341658 0.237790 0.264568 0.285070 0.250952 0.225766 0.228085 0.226008 0.228096 0.230450 0.223276 0.226524 0.228633 0.232398 0.224206
chargesum: 0.00000
title: Mulliken charges with hydrogens summed into heavy atoms:
elementType: O N C C C C C C C C C C C C C C C C C C C C C C
charge: -0.127494 -0.073086 0.065378 0.013056 0.012039 -0.063572 -0.006140 0.000076 0.001993 0.025059 0.381761 0.373697 -0.147598 -0.103545 -0.117506 -0.176482 -0.145454 -0.132953 -0.192632 -0.210316 0.439570 0.440862 -0.131668 -0.125047
polarizability: 2.62100807e+02 1.61885006e+01 2.73597221e+02 5.45494898e+00 1.12696417e+01 2.00326683e+02
1716.lowfreq: -13.4260 -3.5839 -0.0007 -0.0006 -0.0005 4.9612 11.3937 21.1270 24.0992
frequency: -9.5013 21.1135 23.4583 33.7178 34.2786 38.4439 41.7359 45.7355 88.3087 109.5035 136.4632 149.1951 173.6716 196.7919 210.4306 233.4768 242.0031 268.2992 285.6515 302.7553 311.9040 322.6775 344.0135 358.9649 370.0499 382.0162 404.9263 406.0943 408.1531 434.2927 448.9110 457.1479 499.6092 539.4791 549.8367 565.1046 589.0491 636.4594 637.2342 663.3990 726.3054 737.5777 755.3842 777.1310 792.4150 797.6585 803.9562 819.5046 832.7390 850.7310 851.9119 854.1523 858.1354 879.3742 908.2728 917.1256 957.4463 958.7673 960.8327 979.3714 982.9022 985.4121 985.7440 994.9264 1014.0576 1014.7730 1039.7076 1047.4838 1047.6072 1049.6671 1060.3012 1081.2225 1091.0171 1107.5587 1121.7032 1123.9429 1131.0507 1148.2028 1152.4835 1154.4637 1176.1761 1193.3097 1194.6601 1203.5604 1222.1491 1224.7597 1247.3457 1259.5950 1264.1219 1278.9544 1286.9165 1304.3493 1307.7196 1312.3675 1329.4520 1335.4618 1340.8550 1345.5596 1350.3831 1366.0434 1368.4175 1373.1060 1393.2520 1396.3301 1396.9225 1402.6881 1405.3132 1449.4492 1454.6995 1459.4787 1462.3106 1465.6584 1469.2171 1470.8265 1473.4661 1473.8226 1474.8955 1483.8469 1503.3225 1505.7254 1580.7456 1583.0149 1622.1710 1624.6112 2810.9409 2823.5662 2891.5199 2965.5994 2974.0488 2975.3577 2979.3980 2983.4642 2984.2818 3021.6363 3027.7333 3031.3408 3033.9996 3043.8869 3051.9919 3053.1390 3053.2675 3053.7577 3081.1957 3083.3559 3111.0630 3116.8457 3120.3796 3120.9461 3135.6994 3149.3565 3156.2252 3174.8806 3562.5557
redmass: 1.0565 1.0810 3.1883 3.3559 3.6737 3.6298 3.4731 3.8102 3.7066 3.4502 3.4916 4.0306 3.3517 3.7753 3.0539 2.0839 2.6290 1.9577 2.8165 1.8346 2.5118 3.0033 2.9356 3.5425 2.5916 2.1888 2.8535 2.8810 3.0321 3.1321 2.8964 3.3193 2.7176 4.3935 2.0434 3.1213 3.8143 6.8756 6.9602 3.6288 3.2835 2.9797 3.3590 2.4639 2.3813 2.9709 1.4723 1.6102 1.5699 2.5215 1.2692 1.4956 1.2632 2.5403 2.3723 3.3990 1.3081 1.3495 1.3750 1.3782 1.4515 1.3786 1.4242 2.5466 3.0176 2.8536 2.1841 1.5532 1.5561 2.1551 3.3062 2.1374 1.7224 2.2527 2.4683 1.3393 1.4207 1.3689 1.9622 2.0931 1.2700 1.3766 1.1792 2.2239 2.9309 2.6332 1.7170 1.3169 1.1868 1.3610 1.3699 1.2746 1.3250 1.3101 1.2902 1.5850 1.4731 1.5117 1.4982 2.8454 2.7905 2.3299 1.4391 1.2448 1.2514 3.1127 3.2591 1.0919 1.0850 1.0875 1.0924 1.0848 1.0464 1.0470 1.0921 1.1013 1.0986 1.0950 2.5753 2.6323 5.9597 6.2832 6.3067 6.3572 1.0717 1.0699 1.0689 1.0619 1.0373 1.0372 1.0613 1.0615 1.0613 1.0879 1.0905 1.0896 1.0915 1.1034 1.0974 1.1029 1.0974 1.0999 1.0988 1.0987 1.0868 1.0886 1.0888 1.0900 1.0963 1.0945 1.0944 1.0935 1.0658
irintensity: 0.3358 0.3775 0.0593 0.0111 0.0450 0.7258 0.3152 0.0939 0.1717 0.4277 0.9485 0.6754 2.0204 1.2976 1.1347 0.2540 4.0240 40.8063 7.5100 113.8352 1.5962 22.3233 0.4448 21.4665 2.5720 6.0338 2.1041 0.4197 1.8237 2.4306 0.1957 6.6896 1.0856 1.3097 13.4799 26.7071 13.8929 0.8334 0.0955 11.9699 1.3757 6.5979 20.6936 8.2349 5.1499 3.3256 0.2126 64.5103 39.5346 3.0948 1.9466 7.7472 4.0830 10.5191 6.1765 22.3885 2.0276 0.8593 1.4252 0.8975 1.6116 1.2974 4.2283 17.6070 5.2160 11.7652 7.6520 7.5856 16.3371 8.2961 31.5737 12.5074 12.6562 46.0260 5.1381 2.5896 3.4044 7.2461 27.2237 42.0921 8.9425 20.8963 4.3430 4.4278 0.5360 0.5050 9.2010 2.1287 6.6712 10.3306 2.6766 4.8882 10.4073 5.1797 7.5644 17.7175 3.4291 12.3639 2.8438 2.1076 2.0880 25.3932 5.6467 8.6871 8.8264 5.8252 4.1335 6.3037 1.6589 13.0865 10.7731 4.2367 12.6050 12.1871 2.0574 14.9395 18.8899 7.6253 38.9744 23.5742 2.6135 0.8826 3.3047 1.7696 46.6577 148.0514 58.1839 39.7873 48.5115 41.5155 29.9186 34.8509 32.4563 47.2968 83.7489 20.9713 16.6650 19.2239 22.5302 67.4086 14.0273 89.6724 19.5797 19.2532 13.9847 16.0644 30.3506 24.0254 14.4705 16.5308 5.5635 2.8035 6.4092
temp: 298.150 k
press: 1.00000 atm
elementType: 8 7 6 6 6 6 6 6 6 6 6 6 6 6 6 6 6 6 6 6 6 6 6 6 1 1 1 1 1 1 1 1 1 1 1 1 1 1 1 1 1 1 1 1 1 1 1 1 1 1 1 1 1
symmnumber: 1
zpe: 1194625.8 jmol-1
zpe.correction: 0.455009 hartree
zpe.thermalcorrener: 0.478327 hartree
zpe.thermalcorrenthalpy: 0.479271 hartree
zpe.thermalcorrgfe: 0.399505 hartree
zpe.sumelectzpe: -983.912495 hartree
zpe.sumelectthermal: -983.889177 hartree
zpe.sumelectthermalent: -983.888233 hartree
zpe.sumelectthermalfe: -983.967999 hartree
dipole: -0.4910 -0.9446 -0.4059
dipole: 1.1394
quadrupole: -135.8080 -133.1553 -142.8301
quadrupole: 3.3634 2.9700 -1.2602
quadrupole: 1.4565 4.1092 -5.5656 3.3634 2.9700 -1.2602
hfenergy: -984.3675041 hartree
pointgroup: C01[X(C22H29N1O1)]
dipole: 0.1746038 -0.3788794 0.1640302 debye
polarizability: 260.5740631|-15.4256049|274.852614|6.1161793|-11.9921453|200.5980334 unknown
InChI: InChI=1S/C22H29NO/c1-18-6-10-20(11-7-18)22(24,21-12-8-19(2)9-13-21)14-17-23-15-4-3-5-16-23/h6-13,24H,3-5,14-17H2,1-2H3
charge 0 multiplicity 1
53 atoms
O  0.441424 -0.345058 -2.13569
N  -3.287393 -0.463635 0.082552
C  -2.017075 0.062219 -0.485222
C  -3.77774 -1.669563 -0.634189
C  -4.341728 0.582578 0.142584
C  -0.798625 -0.765862 -0.030217
C  -5.019454 -2.2664 0.058985
C  -5.604666 0.062232 0.859493
C  -6.142511 -1.210615 0.166857
C  0.546026 -0.282562 -0.647308
C  0.796023 1.198233 -0.30726
C  1.747231 -1.152142 -0.21788
C  1.123426 1.566383 1.022335
C  2.993657 -0.940837 -0.868238
C  0.674421 2.215557 -1.280868
C  1.677682 -2.152199 0.780452
C  1.318622 2.918695 1.36794
C  4.125317 -1.706376 -0.532267
C  0.876701 3.570741 -0.929532
C  2.818745 -2.919421 1.116792
C  1.199564 3.948712 0.396824
C  4.060187 -2.712738 0.470225
C  1.425612 5.403297 0.774029
C  5.288726 -3.52812 0.835207
H  -1.890846 1.100059 -0.126724
H  -2.044607 0.107748 -1.60128
H  -2.968875 -2.422448 -0.664737
H  -4.037436 -1.420491 -1.699299
H  -4.625537 0.932738 -0.886676
H  -3.931096 1.45508 0.684266
H  -0.747952 -0.710425 1.072987
H  -0.940974 -1.832566 -0.295797
H  -4.732404 -2.607544 1.072451
H  -5.367732 -3.151245 -0.508567
H  -6.375069 0.857445 0.871578
H  -5.344443 -0.171468 1.910187
H  -6.50123 -0.951361 -0.851153
H  -7.009173 -1.6187 0.720972
H  0.445974 -1.30245 -2.391132
H  1.241712 0.789636 1.787774
H  3.058736 -0.16521 -1.639125
H  0.427821 1.935893 -2.30841
H  0.737761 -2.347232 1.306329
H  1.573973 3.180836 2.40258
H  5.076302 -1.523609 -1.048537
H  0.77958 4.345984 -1.699886
H  2.739643 -3.689728 1.893818
H  2.47602 5.582256 1.073918
H  1.199562 6.078876 -0.069076
H  0.789483 5.70317 1.627864
H  5.726558 -4.018468 -0.054385
H  6.078474 -2.88856 1.273653
H  5.048396 -4.314734 1.571001
