program: Gaussian 09
title: 000217940
version: EM64L-G09RevD.01
frameworkgroup: C1[X(C9H9N5O2)]
method: RPBEPBE
basis: SDD
operation: Freq
keyword: #pfreq=noraman
keyword: PBEPBE/SDD
title: #p freq=noraman PBEPBE/SDD
converged: NO YES NO NO
title: Mulliken charges:
elementType: O O N N N N N C C C C C C C C C H H H H H H H H H
charge: -0.290120 -0.258358 -0.151709 -0.174770 -0.219602 -0.082217 0.011424 0.146364 0.093721 0.193576 0.217501 -0.186652 -0.417681 -0.608827 -0.598205 -0.111626 0.279196 0.326372 0.279667 0.272517 0.251671 0.249672 0.268951 0.255325 0.253809
chargesum: 0.00000
title: Mulliken charges with hydrogens summed into heavy atoms:
elementType: O O N N N N N C C C C C C C C C
charge: -0.290120 -0.258358 -0.151709 -0.174770 -0.219602 -0.082217 0.011424 0.146364 0.093721 0.193576 0.217501 0.092544 0.188358 0.165034 0.179881 -0.111626
polarizability: 1.83457167e+02 -3.45663941e+00 1.43565107e+02 -1.28071849e+00 -1.49025924e+00 7.57876341e+01
1716.lowfreq: -8.5392 -5.6094 -0.0006 -0.0001 0.0003 3.6330 23.1339 65.7447 85.9028
frequency: 23.0928 65.7421 85.8943 94.7771 109.9680 115.1448 147.2090 159.2265 198.6453 255.0209 285.3707 294.0159 337.9864 356.1933 367.4320 377.2562 394.2634 413.9818 436.8962 500.5412 563.9201 600.7359 664.6479 669.8579 704.1309 737.4201 745.5994 780.2390 812.2057 909.4719 927.1196 957.8964 970.2174 1014.8641 1047.8138 1129.5186 1131.7932 1158.5717 1165.7441 1210.3599 1219.9994 1242.5935 1262.3294 1303.3700 1309.0674 1363.3787 1386.0383 1410.0747 1427.8734 1430.5377 1463.7204 1472.8080 1475.1523 1478.7294 1479.2568 1504.1534 1574.6442 1618.9828 1645.1185 2208.9524 2977.6692 3010.7568 3015.6193 3045.9065 3101.7979 3109.0376 3141.4823 3142.5316 3242.4905
redmass: 8.0266 7.3309 1.1145 2.7852 1.5019 2.5515 4.0067 7.8398 3.7162 7.1792 2.8460 5.2954 3.4978 3.5023 7.4923 8.1315 8.3948 6.6523 8.0800 6.5299 7.5913 4.6655 7.5959 7.4751 10.9271 5.6252 9.3598 5.3933 1.5058 3.9644 5.1342 4.1704 2.1570 2.8937 3.1056 1.3027 1.3027 3.2271 2.0656 2.0576 3.2678 2.0504 3.8314 4.0004 2.5995 3.9750 1.8442 1.6959 1.2899 1.7479 1.3230 1.0436 1.1845 1.0802 1.0431 2.7519 8.2943 10.8905 9.4872 12.4177 1.0636 1.0335 1.0327 1.0990 1.1027 1.1023 1.1027 1.1014 1.0994
irintensity: 3.6812 3.6641 0.0297 0.1753 1.9625 3.2645 7.1088 9.6143 19.3029 0.1968 1.3921 0.1842 12.7462 1.1330 0.3343 16.9209 13.0300 6.1865 9.9142 16.1400 2.3242 10.7337 2.7380 0.5529 8.6468 25.3756 9.0586 1.9684 22.3471 4.9096 9.7713 33.1793 5.2973 42.5504 16.1420 0.3525 0.0867 29.7269 57.2082 46.0004 10.9710 50.9915 26.8635 42.1426 9.3548 6.5208 14.9264 47.0452 61.7832 141.5376 62.4273 19.9638 51.4998 4.9670 16.6103 138.4887 13.0821 665.7621 315.4516 1.7086 71.8980 30.8653 21.1558 11.3395 15.4326 14.6726 0.6154 0.3450 3.2169
temp: 298.150 k
press: 1.00000 atm
elementType: 8 8 7 7 7 7 7 6 6 6 6 6 6 6 6 6 1 1 1 1 1 1 1 1 1
symmnumber: 1
zpe: 478415.7 jmol-1
zpe.correction: 0.182219 hartree
zpe.thermalcorrener: 0.196924 hartree
zpe.thermalcorrenthalpy: 0.197868 hartree
zpe.thermalcorrgfe: 0.139460 hartree
zpe.sumelectzpe: -771.424638 hartree
zpe.sumelectthermal: -771.409933 hartree
zpe.sumelectthermalent: -771.408989 hartree
zpe.sumelectthermalfe: -771.467396 hartree
dipole: -0.0239 -0.9666 -2.6068
dipole: 2.7803
quadrupole: -109.5645 -93.7864 -92.5238
quadrupole: -1.2933 -11.4399 0.0176
quadrupole: -10.9396 4.8385 6.1011 -1.2933 -11.4399 0.0176
hfenergy: -771.6068567 hartree
pointgroup: C01 [X(C9H9N5O2)]
dipole: 0.0647762 0.4847859 -0.9784154 debye
dipolederiv: -0.9713846 -0.2942865 -0.0947115 -0.3364 -1.0718891 -0.1476657 -0.1412343 -0.1365613 -0.3860716 -1.414853 0.1614969 -0.1289247 0.1461978 -0.516948 0.0018385 -0.1566268 0.0091026 -0.3814977 -1.1644174 -0.1200669 -0.1470548 0.482921 -0.7382408 0.0040432 -0.1107991 -0.0832161 -0.174481 -0.5910837 -0.2666 -0.0368812 -0.4676616 -0.2414896 -0.0728901 -0.0907543 -0.0931025 -0.1428106 -1.3106155 -0.1244429 -0.1702375 -0.2492354 -0.6464632 -0.0901403 -0.2069864 -0.0701684 -0.2459894 -0.8618012 -0.0529402 -0.051143 0.183528 -0.3166816 0.031422 -0.0758919 -0.0158082 -0.2497422 -0.2591171 -0.0178291 -0.0270314 0.0132285 -0.1921602 0.001713 0.0517271 0.0246726 -0.1626884 0.1631358 0.2009471 0.0285581 -0.1694631 -0.9349646 -0.094728 0.0291996 -0.0643435 -0.0502652 1.1401294 0.09127 0.1608924 -0.4033408 0.261635 -0.0207095 0.1288726 0.0363216 0.1185338 1.548802 0.0225435 0.1768272 0.3000875 1.4580093 0.1788459 0.2444315 0.1466539 0.2977919 1.8234204 -0.1322068 0.2112551 -0.2534017 1.1411349 0.0685927 0.2284283 0.0751613 0.3076537 0.3756229 0.2692369 0.0731873 0.503018 0.2856583 0.0527506 0.0938541 0.0990414 -0.021308 0.6489852 0.149066 0.0506168 0.4431801 0.1964673 -0.0495371 0.1062385 -0.0285901 0.3276269 0.1851585 0.2735289 0.0251125 0.2261265 0.3673924 0.0446588 0.0211055 0.0605 0.2086075 0.0941908 -0.1031925 -0.0284731 -0.1866116 0.3471126 -0.0063813 -0.0375691 0.0011823 0.1855421 -0.0005243 -0.0499147 -0.0785508 -0.0533445 -0.0550877 -0.0038947 -0.0952324 -0.002556 -0.0432708 0.0269082 0.025972 -0.018022 0.0201505 0.1255183 -0.0082015 -0.0165044 -0.0098763 0.1724796 0.2428055 0.008745 0.0357416 -0.1923488 0.1245296 0.0168565 0.0274945 0.0253619 0.1203054 -0.0484395 -0.0324709 -0.0218726 -0.019727 0.1039046 0.0667052 -0.0466127 0.0061958 -0.0065879 -0.0021689 -0.0235196 -0.0243165 0.1025697 0.1446613 0.0183727 -0.0108043 -0.0018738 0.1303215 0.0934874 0.018728 0.0894506 -0.0451128 0.0015704 -0.0654287 0.034992 -0.0892976 -0.0366427 0.1189541 0.0003968 -0.0411764 -0.0625919 -0.0351019 0.0563997 0.0020237 0.099766 -0.0327629 0.0947517 -0.1530511 -0.0243219 -0.0276524 0.0688946 -0.0091609 -0.0072609 -0.0317814 0.1233419 0.059429 0.0784989 -0.0607649 0.0347517 0.0617316 -0.0100745 -0.0596132 0.0528046 -0.0521838 0.0086244 0.070091 0.1018407 0.0111322 0.0608065 0.0366135 0.0875226 -0.009589 -0.0059023 unknown
polarizability: 182.3267085|-7.5861021|143.5656486|2.5454102|8.4960763|76.9175511 unknown
InChI: InChI=1S/C9H9N5O2/c1-12-7-6(8(15)13(2)9(12)16)14(4-3-10)5-11-7/h5H,4H2,1-2H3
charge 0 multiplicity 1
25 atoms
O  -0.559594 -2.328108 -0.581681
O  3.674764 -0.449438 0.325544
N  1.852575 1.024535 0.192387
N  -1.6260 0.58651 -0.410524
N  1.560611 -1.361033 -0.120001
N  -0.236953 2.351307 0.008878
N  -4.775242 0.146918 1.096774
C  -0.332479 0.058384 -0.263399
C  0.48976 1.164767 -0.009375
C  0.149495 -1.295506 -0.342626
C  2.440359 -0.263567 0.14455
C  -1.512976 1.960109 -0.236484
C  -2.836453 -0.212922 -0.699598
C  2.697035 2.205963 0.464613
C  2.208875 -2.693432 -0.163005
C  -3.900347 -0.009874 0.302352
H  -2.366407 2.63267 -0.28037
H  -2.521598 -1.275495 -0.715689
H  -3.229486 0.039398 -1.701603
H  3.729192 1.852876 0.600753
H  2.345377 2.718119 1.375372
H  2.644128 2.911354 -0.381174
H  1.423454 -3.435235 -0.367792
H  2.699235 -2.904524 0.800863
H  2.976374 -2.713876 -0.953467
