program: Gaussian 09
title: 000224423
version: EM64L-G09RevD.01
frameworkgroup: C1[X(C15H10BrNO)]
method: RPBEPBE
basis: SDD
operation: Freq
keyword: #p
keyword: freq=noraman
keyword: PBEPBE/SDD
title: #p freq=noraman PBEPBE/SDD
converged: NO YES NO NO
title: Mulliken charges:
elementType: Br O N C C C C C C C C C C C C C C C H H H H H H H H H H
charge: 0.046277 -0.235887 -0.439616 0.274753 0.258902 0.163456 0.212582 -0.497489 0.260324 -0.394150 -0.348798 -0.341647 -0.341695 -0.204496 -0.259356 -0.219746 -0.219742 -0.230874 0.328752 0.232790 0.283093 0.249488 0.249485 0.233025 0.236229 0.234408 0.234406 0.235526
chargesum: 0.00000
title: Mulliken charges with hydrogens summed into heavy atoms:
elementType: Br O N C C C C C C C C C C C C C C C
charge: 0.046277 -0.235887 -0.110863 0.274753 0.258902 0.163456 0.212582 -0.497489 0.260324 -0.161360 -0.065705 -0.092159 -0.092211 0.028529 -0.023127 0.014661 0.014664 0.004651
polarizability: 2.72847204e+02 3.55236072e+00 1.88434355e+02 5.79046937e-03 9.89746941e-03 1.11016135e+02
1716.lowfreq: -34.1649 -4.5808 -2.8164 -0.0007 -0.0006 0.0002 5.4039 51.6935 55.4764
frequency: -34.1454 51.6518 55.4762 62.2083 127.7505 143.5435 197.6113 220.8782 260.9042 261.6238 276.1118 317.6787 323.6283 396.3038 444.3631 471.1017 495.4603 534.7008 572.3558 581.1499 605.9067 611.1815 624.4613 661.3830 662.1592 694.2640 703.3536 766.9534 768.0081 783.6506 792.8480 855.2687 858.1778 874.8398 920.0242 932.2119 968.6150 978.7383 987.9978 1001.9055 1003.2717 1022.2412 1026.5908 1074.6863 1080.0219 1117.3014 1149.4115 1171.5171 1175.2135 1188.1781 1227.0638 1265.5611 1284.8256 1311.5496 1327.6610 1372.0897 1405.4210 1419.1182 1429.8265 1471.1295 1480.2409 1492.6861 1546.8417 1581.0465 1585.1137 1595.5354 1615.1313 1623.3789 3121.6002 3129.6820 3135.4407 3142.4723 3145.7269 3155.9034 3156.7905 3169.5277 3171.7431 3542.9617
redmass: 3.9102 5.7945 6.6729 8.1304 4.9356 9.5769 5.5473 6.9701 5.8997 8.6108 6.3854 7.7146 5.3992 2.8084 3.5340 4.3501 8.8825 3.5732 7.8534 5.0827 3.7668 1.3196 6.3601 6.2555 6.5028 4.5729 1.7904 1.9379 1.6598 6.3028 3.0527 1.2431 5.6756 1.4971 3.3830 1.7734 1.3627 1.3881 6.0654 1.3276 1.3290 2.6353 2.1821 3.5495 1.6010 2.1736 3.2121 1.0758 1.0543 1.1159 2.2811 2.4228 2.0568 1.3587 2.4693 7.2857 7.4369 2.3098 2.1857 2.8022 2.4709 3.3796 10.9780 4.3256 5.9908 7.5183 6.4279 6.2316 1.0882 1.0850 1.0881 1.0890 1.0928 1.0971 1.0936 1.1019 1.1000 1.0777
irintensity: 0.1031 0.8845 0.5282 1.7251 0.4973 0.3803 0.1148 0.1590 0.7009 0.1026 1.3747 6.9675 0.0151 0.1786 2.0289 0.5471 1.8560 8.8531 23.5662 28.1541 13.5209 41.1436 4.4437 1.9481 1.8778 10.9521 49.0896 33.5663 94.2722 18.1791 6.6859 0.7578 24.4275 0.1107 18.3125 0.4960 2.3101 0.3870 2.8284 0.0686 0.6352 3.5332 17.0500 43.2248 8.1510 47.2710 5.7260 0.8645 0.0052 2.2803 3.3415 0.7328 1.1286 0.4294 4.1404 0.2057 21.9003 20.9545 9.7744 55.9571 29.4798 78.6483 154.2456 94.7299 1.3620 88.6047 3.2265 83.3352 5.3025 0.9812 0.2194 11.1557 14.4777 26.2931 6.4900 21.1405 26.1748 59.4176
temp: 298.150 k
press: 1.00000 atm
elementType: 35 8 7 6 6 6 6 6 6 6 6 6 6 6 6 6 6 6 1 1 1 1 1 1 1 1 1 1
symmnumber: 1
zpe: 542871.0 jmol-1
zpe.correction: 0.206769 hartree
zpe.thermalcorrener: 0.220386 hartree
zpe.thermalcorrenthalpy: 0.221330 hartree
zpe.thermalcorrgfe: 0.165081 hartree
zpe.sumelectzpe: -719.823633 hartree
zpe.sumelectthermal: -719.810016 hartree
zpe.sumelectthermalent: -719.809071 hartree
zpe.sumelectthermalfe: -719.865321 hartree
dipole: 1.4986 -7.5801 0.0008
dipole: 7.7268
quadrupole: -93.5514 -115.6271 -109.8752
quadrupole: 4.7946 0.0009 0.0051
quadrupole: 12.7999 -9.2759 -3.5240 4.7946 0.0009 0.0051
hfenergy: -720.0304018 hartree
pointgroup: C01 [X(C15H10Br1N1O1)]
dipole: -0.8928182 2.9058845 0.0010126 debye
polarizability: 271.2305508|12.1025634|190.0510087|-0.001574|0.0086694|111.0161344 unknown
InChI: InChI=1S/C15H10BrNO/c16-13-14(10-6-2-1-3-7-10)17-12-9-5-4-8-11(12)15(13)18/h1-9,17H
charge 0 multiplicity 1
28 atoms
Br -1.147615 -2.957667 -0.001059
O  1.988187 -2.797774 -0.001089
N  0.287743 0.992456 0.000248
C  1.683979 0.901264 0.000195
C  -0.550197 -0.120379 -0.000083
C  2.284594 -0.393117 -0.000128
C  -2.016135 0.186689 -0.000064
C  0.007162 -1.393309 -0.000416
C  1.46086 -1.638509 -0.000272
C  2.488785 2.073911 0.000426
C  3.702188 -0.48804 -0.000246
C  -2.711083 0.345952 1.225833
C  -2.710788 0.347603 -1.225914
C  3.887008 1.951678 0.000318
C  4.499958 0.666583 -0.000023
C  -4.088397 0.660099 1.223977
C  -4.088106 0.661743 -1.223965
C  -4.778773 0.820172 0.00003
H  -0.153475 1.914377 0.0005
H  2.016778 3.06408 0.000674
H  4.135823 -1.493323 -0.000486
H  -2.178364 0.204685 2.17291
H  -2.177847 0.207602 -2.173056
H  4.50851 2.853698 0.000492
H  5.591515 0.583354 -0.000102
H  -4.621065 0.773462 2.174367
H  -4.620548 0.776375 -2.174328
H  -5.847794 1.059935 0.000063
