program: Gaussian 09
title: 000224424
version: EM64L-G09RevD.01
frameworkgroup: C1[X(C15H10ClN)]
method: RPBEPBE
basis: SDD
operation: Freq
keyword: #p
keyword: freq=noraman
keyword: PBEPBE/SDD
title: #p freq=noraman PBEPBE/SDD
converged: YES YES NO NO
title: Mulliken charges:
elementType: Cl N C C C C C C C C C C C C C C C H H H H H H H H H H
charge: -0.048558 -0.008816 0.386230 0.459296 -0.519782 0.320758 -0.085903 -0.389556 -0.314227 -0.210305 -0.386488 -0.388318 -0.183057 -0.235932 -0.237213 -0.363716 -0.237948 0.264149 0.246244 0.263540 0.237528 0.241778 0.255140 0.228368 0.228816 0.245683 0.232289
chargesum: 0.00000
title: Mulliken charges with hydrogens summed into heavy atoms:
elementType: Cl N C C C C C C C C C C C C C C C
charge: -0.048558 -0.008816 0.386230 0.459296 -0.255633 0.320758 -0.085903 -0.143312 -0.050687 -0.210305 -0.148960 -0.146540 0.072083 -0.007563 -0.008397 -0.118033 -0.005659
polarizability: 3.09189769e+02 -6.89006798e+00 1.85154074e+02 4.16879513e+00 8.06153920e+00 7.62368599e+01
1716.lowfreq: -9.3449 -0.0021 -0.0013 0.0017 2.7961 7.6440 43.4235 55.6771 80.4478
frequency: 43.2426 55.6553 80.4450 126.1375 171.9910 184.4758 214.8827 261.9509 302.6403 368.2463 375.5763 404.2595 418.0313 451.3842 501.6104 525.9138 547.8019 568.1725 570.4610 615.6316 661.2051 670.8227 696.1347 700.9553 768.4810 786.4967 795.6550 830.3984 849.6573 852.7405 858.1035 904.6391 924.7388 945.4626 949.3712 974.6235 984.0349 989.5669 995.8713 1015.1426 1040.1535 1057.3164 1086.9063 1138.6762 1173.1469 1175.3216 1195.9922 1227.9935 1262.1241 1283.1250 1303.0653 1327.3726 1351.0816 1374.6345 1379.0873 1421.0763 1422.9538 1445.2016 1477.3177 1502.3442 1535.8217 1574.4840 1586.3096 1612.6806 1627.9689 3125.1463 3129.1866 3133.9543 3141.1836 3144.8798 3150.9145 3154.9050 3166.8780 3171.8015 3181.6782
redmass: 4.2733 5.2529 6.5239 5.2333 5.3456 6.1108 6.1886 7.5374 4.8091 6.4810 7.9350 2.8356 3.3680 3.9364 4.4425 5.9998 3.2201 6.0874 5.8342 6.4229 7.6802 3.5427 6.1208 1.7103 1.8911 3.2064 6.3844 1.2928 1.2575 1.7503 4.4252 1.5050 1.5066 1.4257 5.5191 1.4295 1.4799 3.9194 1.3213 3.3671 1.9724 2.1027 1.6094 1.6781 1.7221 1.1542 1.1376 1.7502 1.7532 2.4704 2.0505 1.8329 2.2421 3.6080 5.0944 3.0080 2.9169 2.7739 2.7548 3.2016 6.8639 7.1757 6.2756 6.0055 6.9446 1.0846 1.0875 1.0905 1.0915 1.0887 1.0959 1.0910 1.1016 1.0970 1.0956
irintensity: 0.0115 0.4356 0.1127 0.0206 0.7374 2.5189 2.2362 0.5405 0.4369 1.5015 5.6686 0.4429 7.5164 4.2902 9.2212 1.0084 1.2891 4.0727 3.3701 0.3494 35.4252 1.5719 2.8502 49.5081 68.6725 0.7432 21.6001 11.6884 1.1838 53.7651 4.8536 17.8312 1.5858 0.3208 18.4564 0.8290 0.6308 0.7507 0.0315 2.0846 5.5187 5.8043 6.8046 0.5664 23.7698 5.6552 2.7379 3.1408 2.3951 6.6238 3.7138 0.7083 41.5656 3.6832 2.0582 22.5911 2.0296 20.8032 86.3124 9.5917 20.9218 35.2945 4.9598 0.3277 9.7628 6.6703 0.2633 21.1004 18.1024 1.1104 33.4908 4.1656 27.3504 9.9698 3.6804
temp: 298.150 k
press: 1.00000 atm
elementType: 17 7 6 6 6 6 6 6 6 6 6 6 6 6 6 6 6 1 1 1 1 1 1 1 1 1 1
symmnumber: 1
zpe: 532489.5 jmol-1
zpe.correction: 0.202815 hartree
zpe.thermalcorrener: 0.215729 hartree
zpe.thermalcorrenthalpy: 0.216673 hartree
zpe.thermalcorrgfe: 0.162296 hartree
zpe.sumelectzpe: -1091.274113 hartree
zpe.sumelectthermal: -1091.261199 hartree
zpe.sumelectthermalent: -1091.260255 hartree
zpe.sumelectthermalfe: -1091.314631 hartree
dipole: -1.4326 0.4327 -0.0123
dipole: 1.4966
quadrupole: -87.8118 -103.5401 -109.4318
quadrupole: 3.9716 0.6810 3.4630
quadrupole: 12.4494 -3.2789 -9.1706 3.9716 0.6810 3.4630
hfenergy: -1091.4769276 hartree
pointgroup: C01 [X(C15H10Cl1N1)]
dipole: -0.5764143 -0.1150229 -0.0344966 debye
polarizability: 309.1969023|-0.446068|159.953306|-9.0158672|46.4391227|101.430494 unknown
InChI: InChI=1S/C15H10ClN/c16-14-8-9-17-15-7-6-12(10-13(14)15)11-4-2-1-3-5-11/h1-10H
charge 0 multiplicity 1
27 atoms
Cl 2.254092 -2.899213 -1.118152
N  3.48446 1.349476 0.376261
C  -0.667508 0.404495 0.127834
C  1.679924 -0.298261 -0.177151
C  0.280065 -0.565594 -0.238974
C  -2.130288 0.120953 0.05643
C  2.143248 1.003723 0.281599
C  -0.196624 1.689508 0.57636
C  1.163391 1.978261 0.651933
C  2.708635 -1.231229 -0.529413
C  -3.03388 0.707137 0.986064
C  -2.660385 -0.745919 -0.939423
C  4.055229 -0.89654 -0.436372
C  -4.416723 0.434104 0.924546
C  -4.042731 -1.019515 -1.00199
C  4.390923 0.418525 0.025379
C  -4.928734 -0.430836 -0.070021
H  -0.046412 -1.562465 -0.550747
H  -0.926885 2.463551 0.834615
H  1.528553 2.955403 0.981657
H  -2.649549 1.354515 1.782339
H  -1.990116 -1.183281 -1.687852
H  4.842271 -1.605205 -0.704875
H  -5.093172 0.888314 1.65702
H  -4.430101 -1.682913 -1.783161
H  5.445457 0.706544 0.105662
H  -6.002641 -0.641739 -0.119165
